program: Gaussian 09
title: 000110990
version: EM64L-G09RevD.01
frameworkgroup: C1[X(C14H14Br4O4)]
method: RPBEPBE
basis: SDD
operation: Freq
keyword: #p
keyword: freq=noraman
keyword: PBEPBE/SDD
title: #p freq=noraman PBEPBE/SDD
converged: YES YES NO NO
title: Mulliken charges:
elementType: Br Br Br Br O O O O C C C C C C C C C C C C C C H H H H H H H H H H H H H H
charge: 0.051543 0.014063 0.037776 0.028859 -0.275319 -0.236797 -0.248293 -0.226975 0.131840 0.241781 -0.384892 -0.409742 -0.282212 -0.209560 0.206349 0.140763 -0.322361 -0.370217 -0.668864 -0.666445 -0.219755 -0.216802 0.325116 0.335331 0.236126 0.273404 0.245675 0.258215 0.272335 0.266690 0.282726 0.313907 0.288247 0.303744 0.240989 0.242755
chargesum: 0.00000
title: Mulliken charges with hydrogens summed into heavy atoms:
elementType: Br Br Br Br O O O O C C C C C C C C C C C C C C
charge: 0.051543 0.014063 0.037776 0.028859 -0.275319 -0.236797 -0.248293 -0.226975 0.131840 0.241781 -0.059776 -0.074411 0.227318 0.294330 0.206349 0.140763 -0.050026 -0.103527 -0.072231 -0.074454 0.021233 0.025953
polarizability: 2.83174767e+02 -1.50319820e+01 2.35629237e+02 6.67392108e+00 -1.27161053e+01 1.72919127e+02
1716.lowfreq: -5.4849 -1.5685 -0.0005 -0.0005 -0.0004 3.4436 12.3975 16.3416 18.9092
frequency: 11.8834 16.1926 18.8873 23.7071 25.6768 31.8456 38.4116 60.0151 64.0195 75.1536 86.8457 102.2370 128.1154 148.5733 153.6774 165.3298 173.9863 184.7585 226.2029 234.2277 268.6163 304.5423 308.7315 332.9873 349.3568 378.8154 401.4530 419.8088 433.4229 450.3813 515.4714 519.1787 524.4802 550.1434 638.1422 639.2370 648.3430 667.9172 680.2025 699.5194 771.8812 778.5751 788.8542 806.6135 854.3018 857.4349 900.9655 925.4118 934.0823 969.4947 974.7632 978.1187 1006.7600 1020.3515 1033.4317 1049.1713 1053.6734 1073.8008 1077.1816 1082.3301 1119.7259 1129.3157 1130.2857 1180.1244 1188.0619 1205.7853 1223.1932 1229.0291 1231.4931 1245.0183 1272.8249 1280.3695 1282.1617 1296.0391 1299.7928 1360.7792 1366.8185 1382.0695 1428.4128 1429.3526 1430.4950 1454.8146 1461.0114 1477.7538 1578.4293 1603.5913 1625.4104 1628.9258 2996.9058 2998.4286 3034.4070 3039.9036 3068.5486 3073.2361 3089.6978 3091.0753 3129.0465 3130.3911 3141.8594 3155.8328 3170.3154 3185.4507
redmass: 14.1460 19.9188 23.7920 21.9873 10.6962 11.8498 9.1109 9.5139 9.2241 11.8591 7.5394 5.2518 5.9939 9.6948 4.5939 4.7638 7.6546 5.2446 4.1405 5.7821 4.6655 4.4726 5.8500 3.1130 6.1287 5.2906 4.6298 3.8476 4.6074 4.5829 3.2072 3.2134 5.0727 4.8307 5.8636 6.1869 5.4750 6.0589 5.9849 4.7993 5.2381 3.6068 1.6686 5.5611 1.4782 1.5535 1.4957 6.1831 7.3622 1.5622 1.6097 1.4194 1.3590 6.7984 3.9563 3.4028 3.9659 2.6595 3.1546 2.5242 1.8576 1.2286 1.2359 1.0623 1.1417 1.1944 3.4361 1.1719 1.1834 2.6491 1.1824 1.1888 1.5181 1.2397 1.2403 1.3651 1.4259 10.6217 1.1192 1.1347 1.9633 1.0823 1.0857 2.5896 7.1301 6.3008 11.8196 10.9449 1.0581 1.0585 1.0590 1.0578 1.1027 1.1005 1.0913 1.0893 1.1059 1.1069 1.0865 1.0915 1.0973 1.0971
irintensity: 0.1937 0.0843 0.0386 0.1931 1.9488 0.3411 1.9288 0.1457 2.6074 1.5993 1.0403 2.6471 5.3300 1.0730 0.4897 0.0998 3.2987 0.6639 0.6790 3.1222 2.8730 5.8052 5.3488 11.8439 13.4176 10.6468 19.7867 0.1032 15.5459 4.2026 13.5408 12.0504 1.1752 4.3380 6.7484 6.9659 30.1942 7.3469 13.9315 53.0373 43.0489 10.8217 34.4797 0.2801 7.8391 17.5235 1.6355 7.5833 1.8828 9.1319 17.7909 3.8763 1.2973 142.1599 95.6242 8.1296 52.4120 39.6717 209.4891 115.6211 35.6978 10.9677 4.5820 0.8320 5.1039 2.9732 135.0374 15.2143 36.9519 331.8856 34.7762 27.6766 31.0131 32.4620 37.0886 10.9482 1.5210 11.4770 6.8405 2.5211 9.4556 20.4799 23.3365 18.5373 30.1100 19.2918 259.6814 108.8383 17.5225 34.1315 16.7243 14.2299 11.0456 3.5311 4.3069 2.4289 2.8183 2.1842 1.4451 7.5513 13.6224 8.3167
temp: 298.150 k
press: 1.00000 atm
elementType: 35 35 35 35 8 8 8 8 6 6 6 6 6 6 6 6 6 6 6 6 6 6 1 1 1 1 1 1 1 1 1 1 1 1 1 1
symmnumber: 1
zpe: 666821.7 jmol-1
zpe.correction: 0.253979 hartree
zpe.thermalcorrener: 0.278121 hartree
zpe.thermalcorrenthalpy: 0.279066 hartree
zpe.thermalcorrgfe: 0.190982 hartree
zpe.sumelectzpe: -894.986704 hartree
zpe.sumelectthermal: -894.962562 hartree
zpe.sumelectthermalent: -894.961617 hartree
zpe.sumelectthermalfe: -895.049701 hartree
dipole: 1.6601 -4.3804 -2.0536
dipole: 5.1148
quadrupole: -168.0392 -144.2875 -168.3124
quadrupole: -0.9787 16.6307 -2.4356
quadrupole: -7.8262 15.9255 -8.0993 -0.9787 16.6307 -2.4356
hfenergy: -895.2406831 hartree
pointgroup: C01 [X(C14H14Br4O4)]
dipole: -1.1563861 1.3956652 -0.8742321 debye
polarizability: 288.1011879|3.2200244|231.5373682|-4.2063942|9.8346238|172.0845749 unknown
InChI: InChI=1S/C14H14Br4O4/c15-5-9(17)7-21-13(19)11-3-1-2-4-12(11)14(20)22-8-10(18)6-16/h1-4,9-10H,5-8H2
charge 0 multiplicity 1
36 atoms
Br 2.805584 0.531154 1.212308
Br 1.360898 -3.064019 2.218274
Br 5.530614 3.063043 0.920588
Br 3.855008 -3.8926 -0.383486
O  0.431939 2.065989 -0.445265
O  -1.011837 -1.804099 0.309353
O  -0.03827 0.055219 -1.540413
O  -2.837004 -2.212143 -1.086333
C  -1.724752 1.088648 -0.092085
C  -2.592152 -0.03914 0.011259
C  2.82198 2.218168 0.086601
C  1.090633 -3.002158 0.203604
C  1.783987 2.087775 -1.039679
C  -0.404293 -3.08391 -0.119263
C  -0.393154 0.967729 -0.758972
C  -2.18274 -1.436614 -0.352555
C  -2.183033 2.358276 0.343538
C  -3.909798 0.134704 0.494232
C  4.216733 2.469842 -0.48809
C  1.855307 -4.142689 -0.467432
C  -3.487797 2.515777 0.854158
C  -4.358549 1.404452 0.917231
H  2.522649 3.011437 0.78998
H  1.48224 -2.014838 -0.088437
H  1.822783 2.988506 -1.682024
H  1.937184 1.181511 -1.65194
H  -0.558083 -3.195876 -1.210467
H  -0.903002 -3.919762 0.402262
H  -1.510262 3.215352 0.261175
H  -4.572648 -0.734776 0.544866
H  4.194463 3.30009 -1.215345
H  4.653466 1.569086 -0.944205
H  1.627807 -4.172781 -1.546762
H  1.658164 -5.120027 -0.002115
H  -3.827472 3.501823 1.187208
H  -5.378793 1.52305 1.29653
