program: Gaussian 09
title: 000110976
version: EM64L-G09RevD.01
frameworkgroup: C1[X(C16H30O2)]
method: RPBEPBE
basis: SDD
operation: Freq
keyword: #pfreq=noraman
keyword: PBEPBE/SDD
title: #p freq=noraman PBEPBE/SDD
converged: YES YES NO NO
title: Mulliken charges:
elementType: O O C C C C C C C C C C C C C C C C H H H H H H H H H H H H H H H H H H H H H H H H H H H H H H
charge: -0.246396 -0.226494 0.011206 -0.423394 -0.375029 -0.431842 -0.387188 -0.388636 -0.386269 -0.426871 -0.384828 -0.382185 -0.505788 -0.372649 0.197104 -0.353503 -0.356615 -0.696943 0.212703 0.217729 0.194249 0.183107 0.241254 0.218839 0.213262 0.187429 0.198651 0.192500 0.201399 0.191193 0.195047 0.214581 0.228477 0.192103 0.195437 0.192553 0.190538 0.255098 0.242630 0.188698 0.190397 0.187941 0.186842 0.195282 0.194452 0.209774 0.209266 0.214886
chargesum: 0.00000
title: Mulliken charges with hydrogens summed into heavy atoms:
elementType: O O C C C C C C C C C C C C C C C C
charge: -0.246396 -0.226494 0.223909 -0.011416 0.049332 0.000260 -0.001108 0.005263 -0.000029 0.016188 0.002713 0.000907 -0.008060 0.006446 0.197104 0.021280 0.033119 -0.063017
polarizability: 2.32660551e+02 3.43900789e+00 1.66048538e+02 -6.28604203e-01 6.47910028e-02 1.41378493e+02
1716.lowfreq: -17.1394 -8.6371 -5.0143 -0.0016 -0.0004 0.0012 9.4766 20.8013 26.0795
frequency: -11.6740 20.6474 25.9088 32.8249 55.1397 57.0887 65.6760 85.5835 92.0573 98.0382 112.7774 125.6639 135.5185 144.0735 146.5978 152.9477 205.9522 234.5776 258.8486 278.1450 295.7437 368.8653 395.9888 412.7668 438.0267 457.6179 481.3625 498.7303 515.3461 531.8633 605.8312 696.2766 718.3845 720.4833 726.5261 740.8037 767.1093 804.6203 837.2996 860.3596 874.6219 887.0471 895.7721 910.8606 927.7527 970.2617 978.6763 992.3336 1004.8388 1012.1758 1022.1138 1035.9090 1045.4701 1061.3191 1068.5056 1076.2462 1078.4874 1081.4579 1083.7936 1102.4556 1122.6744 1138.4811 1148.3307 1171.4833 1182.8028 1203.9043 1206.9477 1212.0966 1233.2094 1234.3278 1249.7713 1258.6967 1259.1659 1275.9110 1277.4617 1280.4065 1283.8409 1290.1748 1293.8014 1294.9690 1301.5395 1320.6342 1321.9298 1328.5199 1338.7754 1346.9608 1350.2228 1352.4431 1354.7215 1358.2924 1369.2077 1387.2887 1440.2730 1442.8532 1457.5208 1458.5830 1458.8931 1462.3106 1462.4898 1466.2596 1471.4393 1475.8997 1476.9457 1477.2402 1482.1066 1486.1325 1488.2539 1651.7155 2947.5256 2948.4536 2949.3504 2950.6775 2952.8137 2957.2063 2961.5985 2964.1855 2967.8295 2968.3400 2971.2482 2972.3180 2981.8484 2985.1599 2986.7368 2989.5150 2990.2939 2992.7202 2997.2903 3008.1547 3019.6342 3024.2493 3032.3237 3041.2523 3049.5732 3054.9599 3058.0758 3068.0722 3069.7856 3074.2373
redmass: 2.3631 3.6401 2.6211 3.5148 2.9882 2.1292 3.0051 2.6985 2.4364 3.0417 2.6302 2.0766 2.5387 2.1300 3.5780 2.2483 3.2204 1.1086 1.9064 3.4292 3.9745 3.1037 3.9077 3.0431 3.5670 3.1663 2.9633 3.0553 3.2974 2.9158 3.0136 2.7405 1.0585 1.0709 1.1042 1.1576 1.1948 1.2657 1.4781 1.4925 3.5295 1.9079 2.2217 1.5173 1.7079 1.2397 5.0538 4.3504 1.9762 2.5752 1.4016 3.1716 1.8060 2.4964 2.2866 2.4447 2.0241 2.2201 2.1758 1.9396 2.5831 2.3676 1.9955 1.6738 1.8029 1.4126 1.5141 1.4814 1.3935 1.3284 1.2517 1.2939 1.2780 1.0176 1.2198 1.2565 1.0540 1.0903 1.1403 1.1176 1.3086 1.3546 1.4346 1.2525 1.4300 1.4542 1.5534 1.6900 1.6485 1.6089 1.7623 1.2169 1.0839 1.0809 1.0864 1.0738 1.0742 1.0655 1.0715 1.0795 1.0835 1.0875 1.0790 1.0480 1.0890 1.0933 1.0930 11.9677 1.0588 1.0585 1.0589 1.0591 1.0596 1.0600 1.0619 1.0615 1.0593 1.0634 1.0366 1.0809 1.0959 1.0963 1.0647 1.0652 1.0977 1.0635 1.1005 1.1025 1.1014 1.0997 1.1048 1.1045 1.0992 1.1008 1.1013 1.1007 1.0993 1.0968
irintensity: 0.1212 0.5204 1.3676 0.9261 1.4937 1.2048 0.3569 1.5235 0.3600 0.3728 0.2983 0.0925 0.2974 0.1016 0.3070 0.4718 0.4777 0.0004 1.6274 0.2356 0.3158 0.8211 0.3626 2.3257 3.2017 0.8718 2.0359 2.1895 3.4283 0.7931 5.2383 11.6014 18.3266 0.0452 6.2391 0.2345 2.8105 2.5573 11.1473 0.9296 26.4590 6.2029 11.6451 5.2271 5.7319 0.5468 0.3995 22.2548 93.9140 0.4000 55.0074 0.8732 26.1592 15.7873 33.2656 4.0067 0.7018 3.0821 1.8438 1.3464 10.4925 64.1299 48.4685 9.7604 0.3353 70.4176 8.6832 74.1312 0.8827 0.5331 0.9857 1.8498 1.2631 0.4000 1.2106 0.6736 1.1367 2.1909 0.0216 2.1221 1.1661 3.4505 2.9475 3.4109 0.3230 2.4915 3.2831 0.2070 0.1820 2.4041 6.3969 11.1859 5.0963 6.3351 12.6482 0.0538 1.6159 0.2174 0.0658 0.4511 0.5580 12.6911 2.4279 11.0576 1.4499 5.0876 37.0791 289.6079 1.9832 1.2323 1.0983 1.5755 2.9067 0.3020 22.9789 61.2343 89.5029 144.0911 36.8414 29.0205 1.7743 1.6189 33.6465 29.7152 5.6225 19.4888 2.6959 1.9506 12.7970 5.1238 0.2307 195.3647 5.1072 72.1024 117.2503 100.1041 55.5536 19.4486
temp: 298.150 k
press: 1.00000 atm
elementType: 8 8 6 6 6 6 6 6 6 6 6 6 6 6 6 6 6 6 1 1 1 1 1 1 1 1 1 1 1 1 1 1 1 1 1 1 1 1 1 1 1 1 1 1 1 1 1 1
symmnumber: 1
zpe: 1128410.5 jmol-1
zpe.correction: 0.429789 hartree
zpe.thermalcorrener: 0.450979 hartree
zpe.thermalcorrenthalpy: 0.451924 hartree
zpe.thermalcorrgfe: 0.376365 hartree
zpe.sumelectzpe: -776.682876 hartree
zpe.sumelectthermal: -776.661686 hartree
zpe.sumelectthermalent: -776.660741 hartree
zpe.sumelectthermalfe: -776.736300 hartree
dipole: 0.9832 -5.0817 0.4698
dipole: 5.1973
quadrupole: -101.5183 -125.0892 -111.6742
quadrupole: -26.6452 1.6570 -0.2824
quadrupole: 11.2423 -12.3286 1.0864 -26.6452 1.6570 -0.2824
hfenergy: -777.112665 hartree
pointgroup: C01 [X(C16H30O2)]
dipole: 0.3774539 -1.9815401 0.3348068 debye
polarizability: 232.6881026|3.0268711|165.8829538|-1.1625521|-1.8052753|141.5165253 unknown
InChI: InChI=1S/C16H30O2/c1-2-3-4-5-6-7-8-9-10-12-15-13-11-14-16(17)18-15/h15H,2-14H2,1H3
charge 0 multiplicity 1
48 atoms
O  4.347753 0.743853 -0.065563
O  5.588177 2.60337 -0.485044
C  4.214504 -0.698001 0.368443
C  2.868719 -1.176103 -0.191749
C  1.653426 -0.403807 0.366542
C  5.421061 -1.539321 -0.068755
C  0.313239 -0.882714 -0.234074
C  -0.908365 -0.126284 0.334352
C  -2.254019 -0.599794 -0.259759
C  6.731592 -0.861276 0.378046
C  -3.474749 0.154034 0.314547
C  -4.822513 -0.325162 -0.27046
C  6.854967 0.521829 -0.293149
C  -6.043035 0.425993 0.308158
C  5.58262 1.374251 -0.268183
C  -7.39242 -0.057276 -0.269855
C  -8.612051 0.693205 0.312663
C  -9.956454 0.202304 -0.267234
H  4.170434 -0.660681 1.477162
H  2.896215 -1.08662 -1.295921
H  2.766441 -2.255812 0.044302
H  1.621251 -0.518547 1.470655
H  1.792085 0.674982 0.164751
H  5.324798 -2.544769 0.382342
H  5.411172 -1.66929 -1.169247
H  0.18893 -1.970775 -0.047621
H  0.339996 -0.756752 -1.336666
H  -0.932973 -0.247611 1.437696
H  -0.785452 0.960221 0.144568
H  -2.37475 -1.687731 -0.072787
H  -2.232195 -0.474786 -1.362665
H  6.729387 -0.748788 1.480214
H  7.608048 -1.48251 0.119686
H  -3.492048 0.034737 1.418256
H  -3.357688 1.241043 0.122003
H  -4.807173 -0.203662 -1.37392
H  -4.938138 -1.412928 -0.079782
H  7.659114 1.132296 0.152351
H  7.116093 0.399148 -1.363577
H  -6.054923 0.30833 1.412188
H  -5.930004 1.513244 0.113613
H  -7.383577 0.062035 -1.37365
H  -7.506566 -1.144683 -0.076336
H  -8.498386 1.779187 0.117323
H  -8.618374 0.575285 1.415643
H  -9.988245 0.34004 -1.364689
H  -10.107034 -0.87435 -0.061001
H  -10.811689 0.752446 0.166985
