program: Gaussian 09
title: 000110942
version: EM64L-G09RevD.01
frameworkgroup: C1[X(C18H27NO2)]
method: RPBEPBE
basis: SDD
operation: Freq
keyword: #p
keyword: freq=noraman
keyword: PBEPBE/SDD
title: #p freq=noraman PBEPBE/SDD
converged: YES YES NO NO
title: Mulliken charges:
elementType: O O N C C C C C C C C C C C C C C C C C C H H H H H H H H H H H H H H H H H H H H H H H H H H H
charge: -0.277824 -0.252643 -0.053247 0.036413 -0.436413 -0.420146 -0.393285 -0.398488 -0.366267 -0.009590 0.203174 -0.384269 0.445283 -0.617231 -0.745946 -0.721716 -0.433649 -0.365833 -0.234925 -0.251367 -0.244288 0.230587 0.209790 0.221552 0.216293 0.226537 0.220506 0.177317 0.180950 0.219383 0.240584 0.198552 0.241159 0.212771 0.187823 0.224668 0.225052 0.224657 0.237266 0.206980 0.213374 0.207102 0.219748 0.230339 0.273662 0.224016 0.224448 0.227142
chargesum: 0.00000
title: Mulliken charges with hydrogens summed into heavy atoms:
elementType: O O N C C C C C C C C C C C C C C C C C C
charge: -0.277824 -0.252643 -0.053247 0.266999 -0.005071 0.022685 0.004538 0.001845 -0.125684 0.188962 0.203174 0.069661 0.445283 0.020312 -0.077043 -0.081492 -0.203310 -0.092171 -0.010909 -0.026919 -0.017146
polarizability: 2.45220221e+02 2.24919625e+01 1.86642670e+02 2.40085892e+00 -3.24853361e+00 1.82293402e+02
1716.lowfreq: -11.6935 -6.3559 -4.3971 -0.0005 -0.0001 0.0004 5.3150 22.4757 37.8285
frequency: 4.2485 21.9946 37.8100 44.9516 56.8684 65.7479 72.1559 89.1620 111.1206 159.2534 177.4641 183.6360 198.8609 214.6304 224.0930 240.1902 245.3052 250.1077 274.7995 302.0984 314.4500 328.8372 345.6551 367.0119 400.4344 407.1694 429.9832 452.8026 462.9643 481.2276 523.0298 588.4846 615.6046 649.1591 695.7386 710.3160 727.3875 744.2787 755.1354 776.5683 791.5771 817.6568 836.5798 854.8929 858.1837 892.4888 909.5012 922.3611 931.5262 963.0664 964.1837 980.3889 981.0070 988.0035 990.5306 997.8374 1005.0690 1029.0714 1031.8095 1037.7789 1067.4316 1075.2818 1086.1296 1089.4610 1103.3251 1124.8083 1128.1191 1131.7262 1144.0404 1147.2775 1165.8635 1171.4854 1193.0995 1193.8339 1205.3836 1231.3482 1260.5137 1267.5321 1269.7263 1274.1778 1293.1163 1306.0924 1309.2964 1315.8943 1335.6214 1338.9136 1344.1755 1352.2320 1357.6763 1360.1311 1375.3547 1381.9559 1385.9006 1392.5312 1431.0045 1442.4499 1452.2063 1462.9605 1465.3028 1465.7722 1468.2593 1473.4094 1480.5543 1480.7743 1482.4931 1482.9367 1485.7133 1489.0829 1589.6327 1610.8953 1621.8143 2816.4279 2826.6461 2858.8979 2950.5187 2973.9181 2977.6424 2988.3266 3005.4400 3007.3767 3013.5229 3018.9759 3029.6756 3029.8200 3035.2031 3041.5579 3067.8485 3069.7269 3073.2289 3076.1113 3077.1180 3079.3228 3082.0799 3114.9086 3125.3231 3138.6190 3155.4335 3166.8835
redmass: 4.2829 3.2518 3.5285 3.4388 3.8323 2.4843 3.1591 3.5160 4.2543 3.3808 3.7803 4.8795 1.0365 1.3775 3.3674 1.3913 1.4378 3.1260 3.2452 2.9432 3.1874 4.8308 2.0060 2.8394 2.9020 2.8767 3.2312 2.2937 3.5970 3.0735 3.6077 2.8109 6.3300 3.9392 5.6227 1.7440 5.0083 3.3169 2.5601 1.4944 2.0768 1.4592 2.2858 2.5380 1.2509 3.9876 1.9437 1.8193 1.8278 1.3409 2.2807 1.3827 1.4325 1.9948 5.4109 1.3520 2.6444 2.2672 2.3975 2.6399 1.6751 1.8846 1.7170 1.5296 2.4712 2.1059 2.0181 1.9984 1.4416 2.1402 2.0712 1.0617 2.0838 1.2349 1.5971 1.2687 1.3785 1.2389 1.7915 1.4074 1.2802 1.2595 1.3472 1.4381 1.3266 1.3715 1.5079 1.5011 1.5075 1.7657 1.3945 1.2249 3.7121 1.2330 1.1771 2.1088 1.0901 1.0556 1.0753 1.0918 1.0519 1.0569 1.0659 1.0946 2.1515 1.0593 1.0682 1.0579 5.9944 6.0289 9.0622 1.0718 1.0695 1.0574 1.0829 1.0360 1.0362 1.0607 1.0638 1.0641 1.0791 1.0727 1.0842 1.0851 1.0866 1.0999 1.0997 1.0989 1.1038 1.1002 1.1010 1.1037 1.0986 1.0863 1.0872 1.0932 1.0967 1.0988
irintensity: 0.2139 0.5782 0.0347 0.4726 0.5502 0.1279 0.3210 0.4067 1.5200 1.6942 0.6244 0.7118 0.2355 0.2600 1.7703 0.1899 1.5547 11.5605 1.9384 1.1201 2.4876 3.5316 4.7014 4.2462 2.2758 0.2248 5.8563 1.4195 2.3173 0.3789 9.2782 3.5536 0.1932 10.5745 5.4809 56.2764 3.4386 13.2840 11.9964 22.0421 7.9274 0.4910 1.2537 0.2418 0.4156 3.9324 2.2139 1.8578 28.4525 12.6385 34.7942 0.4352 5.6056 2.5972 1.3016 2.6158 124.4996 13.7723 39.0575 11.5864 28.4177 146.9916 22.0902 11.8937 215.7719 23.6017 39.9867 25.1056 20.1431 18.2499 6.1508 0.5988 4.5540 2.0040 0.4926 2.5578 5.2254 7.5447 22.6491 7.3652 65.4912 7.1238 0.5729 11.0753 7.2441 0.6232 40.1305 9.4400 4.7401 5.9537 3.0854 11.5517 4.5089 17.2081 2.8899 10.9310 7.6430 22.1313 1.2466 14.4752 3.4586 12.9051 4.8145 13.4109 23.4997 9.2095 16.6907 7.3518 2.9150 11.6405 114.4291 53.8962 91.3999 200.3134 28.8061 37.2733 31.9822 23.5860 4.9945 12.0843 25.3223 46.0824 9.4026 65.0384 30.3591 1.3252 7.0793 74.2050 11.4314 53.3882 37.0674 39.1715 39.8418 6.8269 1.8487 32.6631 26.1707 14.7042
temp: 298.150 k
press: 1.00000 atm
elementType: 8 8 7 6 6 6 6 6 6 6 6 6 6 6 6 6 6 6 6 6 6 1 1 1 1 1 1 1 1 1 1 1 1 1 1 1 1 1 1 1 1 1 1 1 1 1 1 1
symmnumber: 1
zpe: 1088000.7 jmol-1
zpe.correction: 0.414398 hartree
zpe.thermalcorrener: 0.436416 hartree
zpe.thermalcorrenthalpy: 0.437360 hartree
zpe.thermalcorrgfe: 0.359876 hartree
zpe.sumelectzpe: -905.688686 hartree
zpe.sumelectthermal: -905.666668 hartree
zpe.sumelectthermalent: -905.665724 hartree
zpe.sumelectthermalfe: -905.743208 hartree
dipole: 1.3059 -0.1286 0.6745
dipole: 1.4755
quadrupole: -114.2488 -125.1567 -127.9475
quadrupole: 0.2597 -4.5347 -0.6621
quadrupole: 8.2022 -2.7057 -5.4965 0.2597 -4.5347 -0.6621
hfenergy: -906.103084 hartree
pointgroup: C01 [X(C18H27N1O2)]
dipole: -0.5055171 -0.0079656 0.2852302 debye
polarizability: 238.9041015|28.7341114|192.6819284|-5.1368804|1.7704205|182.5702631 unknown
InChI: InChI=1S/C18H27NO2/c1-4-14(2)17(15-8-6-5-7-9-15)18(20)21-16-10-12-19(3)13-11-16/h5-9,14,16-17H,4,10-13H2,1-3H3
charge 0 multiplicity 1
48 atoms
O  -0.966391 0.209842 0.590184
O  -0.036366 -0.131783 -1.519475
N  -5.163338 -0.467418 0.346175
C  -2.344174 0.190263 -0.008473
C  -3.239434 1.009077 0.927238
C  -2.846254 -1.257473 -0.129984
C  -4.702394 0.938599 0.438372
C  -4.321808 -1.256254 -0.585707
C  1.419829 0.010693 0.502903
C  1.962672 -1.480604 0.589562
C  0.110848 0.02736 -0.282305
C  2.48256 -2.035425 -0.763145
C  2.447585 1.022045 -0.015239
C  -6.598911 -0.562034 0.017487
C  3.027346 -1.577588 1.707389
C  2.70942 -3.564126 -0.747877
C  3.183975 1.787688 0.926704
C  2.707077 1.219021 -1.397598
C  4.163205 2.715576 0.506557
C  3.682195 2.150446 -1.81885
C  4.41765 2.899747 -0.871654
H  -2.278686 0.651624 -1.013234
H  -2.899875 2.060403 0.960587
H  -3.17494 0.591471 1.94833
H  -2.771883 -1.748906 0.857544
H  -2.22871 -1.8176 -0.85478
H  -5.356294 1.47642 1.149301
H  -4.789487 1.462121 -0.552185
H  -4.3865 -0.855426 -1.63314
H  -4.702329 -2.294005 -0.610177
H  1.15378 0.29348 1.537476
H  1.090841 -2.099717 0.89582
H  1.754138 -1.789204 -1.55822
H  3.427367 -1.521721 -1.026848
H  -6.853485 -0.134684 -0.986136
H  -7.191524 -0.02244 0.777852
H  -6.914597 -1.620634 0.02724
H  3.362589 -2.621109 1.840601
H  3.912585 -0.962577 1.463006
H  2.625244 -1.230482 2.677795
H  3.49774 -3.861307 -0.032402
H  1.781706 -4.100972 -0.470645
H  3.017635 -3.922805 -1.747074
H  2.984351 1.658968 1.997861
H  2.128358 0.657613 -2.137231
H  4.719216 3.296012 1.251685
H  3.865516 2.292841 -2.890097
H  5.173251 3.621285 -1.202494
