program: Gaussian 09
title: 000110913
version: EM64L-G09RevD.01
frameworkgroup: C1[X(C18H25NO)]
method: RPBEPBE
basis: SDD
operation: Freq
keyword: #p
keyword: freq=noraman
keyword: PBEPBE/SDD
title: #p freq=noraman PBEPBE/SDD
converged: YES YES NO NO
title: Mulliken charges:
elementType: O N C C C C C C C C C C C C C C C C C C H H H H H H H H H H H H H H H H H H H H H H H H H
charge: -0.440107 -0.083522 0.248728 -0.120172 -0.163562 -0.493068 0.318099 -0.610326 -0.403803 -0.459783 0.290461 -0.801005 -0.422671 -0.557817 -0.735430 -0.373665 0.262507 -0.429457 -0.051814 -0.584949 0.219282 0.210473 0.210335 0.203508 0.227929 0.228156 0.208133 0.225983 0.198355 0.212807 0.206886 0.243145 0.220228 0.182138 0.209484 0.258782 0.243099 0.221870 0.210948 0.232087 0.218544 0.233907 0.352046 0.215602 0.217628
chargesum: 0.00000
title: Mulliken charges with hydrogens summed into heavy atoms:
elementType: O N C C C C C C C C C C C C C C C C C C
charge: -0.088061 -0.083522 0.248728 0.099109 0.046912 -0.079225 0.318099 -0.154241 0.030313 -0.048622 0.290461 -0.130746 -0.031049 -0.299035 -0.059513 -0.141577 0.262507 -0.210913 0.182092 -0.151719
polarizability: 2.31276196e+02 7.69314379e+00 2.01287026e+02 6.40967880e+00 -6.15848222e+00 1.62167146e+02
1716.lowfreq: -6.8081 -5.9590 -0.0007 -0.0005 0.0002 15.2631 35.0164 59.1456 73.2885
frequency: 34.9825 59.1366 73.2615 86.3881 91.3749 117.4072 140.6997 149.3606 173.3642 202.6184 217.0962 235.1066 243.8405 259.6399 268.5821 300.6623 330.2907 338.2104 341.6033 352.8324 371.4809 388.4601 418.0504 426.1793 444.3346 464.5566 480.5323 509.8795 514.5833 556.6904 598.9073 620.0231 646.6646 677.6284 694.3556 721.3399 733.7969 757.0862 780.1235 791.9467 818.4436 857.8407 879.2687 889.4298 910.1190 918.5799 933.1963 939.3334 947.2559 956.3452 967.8139 981.2074 1012.7930 1019.3781 1031.4101 1043.9053 1062.7766 1065.7016 1081.1170 1095.3117 1111.1901 1125.8339 1131.5550 1138.7003 1149.7812 1153.1943 1174.7574 1187.0053 1205.2374 1214.9680 1222.5013 1235.6912 1240.5827 1260.2155 1269.9459 1273.7437 1279.2011 1290.1046 1311.7320 1322.7662 1334.1970 1335.8148 1340.2251 1354.9961 1365.9134 1380.1356 1381.3108 1387.9274 1391.9439 1425.3513 1436.9193 1449.6606 1454.2198 1457.2831 1467.8670 1480.8478 1481.3447 1488.9932 1490.6912 1492.8987 1500.2830 1586.4524 1628.3562 1656.1731 2850.1050 2871.8975 2951.4895 2971.2984 2979.1296 2980.3038 2981.5520 2982.8110 2985.1648 2989.4570 3003.2973 3023.2620 3024.4407 3044.2588 3065.2983 3070.2694 3079.6415 3083.0291 3093.1012 3101.3829 3106.8211 3130.6155 3162.0784 3193.8958 3583.2619
redmass: 4.6239 3.1416 3.3394 3.5342 2.4575 2.5861 2.9070 1.3729 2.3930 2.3513 1.7322 2.5352 2.1425 2.5722 2.9890 2.5403 3.1140 2.5031 1.1207 2.2590 3.8241 2.9884 2.6480 2.8525 3.4947 3.3482 4.0011 2.5850 2.8559 3.0170 2.1013 2.9165 2.5859 4.6311 4.0111 2.5694 3.2846 1.8255 2.7473 1.4184 1.9741 1.9604 1.8505 1.9002 1.4969 1.5823 2.4086 1.7482 1.3498 2.6061 1.9180 1.6945 1.2076 1.8657 1.9074 1.8225 2.2727 2.6654 2.0151 2.0603 2.6834 1.8630 2.2743 1.9337 1.3314 1.6615 2.2550 1.9033 2.0723 1.4992 1.3241 1.5593 1.3467 2.5094 1.3680 1.2794 1.5208 1.3988 1.5067 1.5165 1.4044 1.3896 1.4165 1.5750 1.3381 3.1431 1.4698 1.3606 1.2326 1.2136 2.3061 1.1424 1.1798 1.0923 1.0593 1.0473 1.0539 1.0991 1.5776 1.2349 1.2244 7.0676 6.4524 4.7217 1.0691 1.0711 1.0637 1.0799 1.0709 1.0468 1.0589 1.0577 1.0708 1.0611 1.0975 1.0984 1.0879 1.1023 1.0965 1.0990 1.0998 1.0602 1.0991 1.0937 1.0865 1.0969 1.0901 1.1141 1.0660
irintensity: 0.0229 0.0361 0.0835 0.4881 1.0944 0.1663 0.0567 0.1586 2.7929 0.6802 1.6387 2.3240 0.1675 1.0182 1.8941 1.4661 3.7871 1.9643 133.7587 1.9669 1.2835 6.3666 0.4780 1.0534 6.7402 6.1660 3.9645 2.9583 4.7894 1.1801 7.2499 5.7570 2.3063 1.0780 9.1369 3.4924 2.9487 14.1736 4.4136 36.9449 9.9638 22.1125 3.9634 7.9039 12.6096 5.7686 40.2707 8.4805 66.8461 1.9854 20.9744 26.2819 9.4687 23.3893 15.7930 11.9812 0.2355 4.4513 9.9293 3.6767 25.7102 12.2235 34.1607 30.2003 70.3195 67.1025 12.2604 6.9198 17.5053 6.6163 2.7476 5.5758 0.7470 22.2227 8.4196 2.0349 25.6340 3.2153 25.2152 3.9266 1.3953 10.0168 23.5763 3.5086 4.5997 1.7759 32.4239 4.3446 24.5060 13.9322 5.1411 7.3435 8.7140 3.8713 15.9139 5.9620 4.2185 10.6804 37.1070 35.3327 30.8184 32.5921 47.9952 9.6354 65.9699 79.7801 17.4845 24.6643 16.5419 29.1856 7.8657 2.3260 138.4398 37.1982 33.2924 20.7488 30.0300 51.1625 38.5993 43.3642 46.3273 14.4734 27.6774 10.2099 15.9825 26.8575 4.8251 29.0665 34.2889
temp: 298.150 k
press: 1.00000 atm
elementType: 8 7 6 6 6 6 6 6 6 6 6 6 6 6 6 6 6 6 6 6 1 1 1 1 1 1 1 1 1 1 1 1 1 1 1 1 1 1 1 1 1 1 1 1 1
symmnumber: 1
zpe: 1019222.4 jmol-1
zpe.correction: 0.388201 hartree
zpe.thermalcorrener: 0.407655 hartree
zpe.thermalcorrenthalpy: 0.408599 hartree
zpe.thermalcorrgfe: 0.341787 hartree
zpe.sumelectzpe: -829.339906 hartree
zpe.sumelectthermal: -829.320452 hartree
zpe.sumelectthermalent: -829.319508 hartree
zpe.sumelectthermalfe: -829.386320 hartree
dipole: -0.0342 -1.3874 1.2147
dipole: 1.8443
quadrupole: -121.6121 -112.7968 -121.0519
quadrupole: 7.2921 -1.8798 -2.7556
quadrupole: -3.1252 5.6902 -2.5650 7.2921 -1.8798 -2.7556
hfenergy: -829.7281069 hartree
pointgroup: C01 [X(C18H25N1O1)]
dipole: -0.0295632 -0.5344242 0.4899376 debye
polarizability: 231.7451142|6.871599|200.5376318|5.9469478|-7.2173379|162.4476228 unknown
InChI: InChI=1S/C18H25NO/c1-4-9-19-10-8-18(5-2)13(3)17(19)11-14-6-7-15(20)12-16(14)18/h4,6-7,12-13,17,20H,1,5,8-11H2,2-3H3
charge 0 multiplicity 1
45 atoms
O  -4.513542 -1.421348 -1.122869
N  2.225675 0.011257 0.089454
C  -0.393065 1.268475 -0.398933
C  0.507242 1.659005 0.829492
C  1.356651 0.422582 1.22699
C  0.539255 0.785765 -1.564348
C  -1.300731 0.078036 -0.000012
C  0.410155 -0.677937 1.788382
C  1.486275 -0.35258 -1.143053
C  -1.211589 2.493808 -0.908916
C  -0.887565 -0.850189 1.003962
C  1.404785 2.89774 0.61947
C  3.280687 -0.963972 0.446237
C  -2.517001 -0.162231 -0.685812
C  -2.165139 3.134985 0.121848
C  -1.710756 -1.965331 1.294212
C  -3.320233 -1.279748 -0.383251
C  -2.924847 -2.196455 0.617778
C  4.440766 -0.927609 -0.531116
C  4.999288 -2.016291 -1.116119
H  -0.166886 1.867892 1.686266
H  2.045886 0.720819 2.043044
H  1.139925 1.645731 -1.91762
H  -0.084359 0.446021 -2.413952
H  0.163332 -0.409703 2.837236
H  0.945935 -1.6468 1.844314
H  0.909604 -1.302013 -1.015858
H  2.226553 -0.53507 -1.944094
H  -1.787643 2.197032 -1.807035
H  -0.493727 3.256065 -1.268377
H  1.975372 3.101928 1.545632
H  2.140045 2.729443 -0.185374
H  0.8215 3.806029 0.386786
H  2.902409 -2.015235 0.521463
H  3.656577 -0.685335 1.452881
H  -2.873726 0.512098 -1.46928
H  -2.889147 2.397903 0.51235
H  -1.612021 3.554102 0.982299
H  -2.737593 3.961317 -0.338428
H  -1.388189 -2.674617 2.066945
H  -3.543696 -3.070274 0.860144
H  4.833405 0.078274 -0.741875
H  -5.00445 -2.231824 -0.839139
H  5.857666 -1.92965 -1.791733
H  4.61322 -3.027496 -0.93329
