program: Gaussian 09
title: 000110901
version: EM64L-G09RevD.01
frameworkgroup: C1[X(C11H14O2)]
method: RPBEPBE
basis: SDD
operation: Freq
keyword: #pfreq=noraman
keyword: PBEPBE/SDD
title: #p freq=noraman PBEPBE/SDD
converged: YES YES NO NO
title: Mulliken charges:
elementType: O O C C C C C C C C C C C H H H H H H H H H H H H H H
charge: -0.431104 -0.265934 -0.181934 -0.504117 -0.513028 -0.202478 0.355263 -0.358047 -0.390720 -0.353647 -0.369505 0.320869 -0.537636 0.251053 0.230884 0.237721 0.235452 0.237757 0.218320 0.326724 0.271158 0.250433 0.249579 0.237658 0.219770 0.220566 0.244943
chargesum: 0.00000
title: Mulliken charges with hydrogens summed into heavy atoms:
elementType: O O C C C C C C C C C C C
charge: -0.104380 -0.265934 0.069119 -0.035512 -0.039819 0.015842 0.355263 -0.086889 -0.140286 -0.104068 -0.131846 0.320869 0.147643
polarizability: 1.74720964e+02 3.86692916e+00 1.21656322e+02 -1.78131421e+00 -2.79710223e+00 7.65930054e+01
1716.lowfreq: -15.3282 -6.5593 -0.0004 -0.0002 0.0005 3.1373 31.4591 58.3772 80.4076
frequency: 31.3391 58.2924 80.4055 119.2810 130.4507 200.3319 213.1701 242.4533 257.1543 289.5160 307.5547 350.7024 409.6827 415.3847 462.1029 484.6411 515.6072 572.5646 631.2019 698.6793 749.4735 766.2642 803.1853 817.5896 822.0118 848.5578 859.1039 900.5451 942.8470 945.1944 967.0245 977.0868 987.7936 1005.4074 1040.7829 1062.3489 1103.2862 1109.0302 1112.0132 1132.1644 1155.4085 1165.3176 1176.0291 1199.3049 1204.0838 1225.8039 1229.0937 1264.3221 1299.6159 1356.2746 1368.7504 1392.2297 1417.6932 1435.5672 1444.9422 1466.3090 1470.9288 1472.3275 1499.5405 1581.5194 1622.5536 2957.8464 3000.9624 3044.9795 3091.2829 3096.5841 3106.6938 3124.1842 3141.0797 3145.0953 3162.6350 3168.5022 3189.4863 3209.6280 3541.7290
redmass: 4.0114 3.1782 3.6484 3.2748 3.5811 3.2517 1.4886 2.9216 2.0257 4.0891 1.2827 4.2177 3.6699 3.0019 4.0402 3.5091 3.0469 3.9718 6.9432 2.9025 3.1712 1.4689 1.7913 1.4156 1.4554 1.7512 2.7517 4.3532 1.4775 2.6325 2.5608 1.3514 8.0700 2.5237 1.2388 1.2645 1.4219 1.1617 1.2610 1.6321 1.3234 1.4146 1.2620 1.4738 2.4040 1.8386 2.8893 1.4195 1.2796 1.1828 3.5535 2.2700 3.5583 1.1656 1.0893 1.0504 1.3003 1.0864 2.4648 7.3206 6.3558 1.0330 1.0837 1.1039 1.0548 1.0762 1.0719 1.0991 1.0872 1.0878 1.0951 1.0968 1.1169 1.1149 1.0659
irintensity: 0.5136 0.4023 0.6618 3.7558 4.5291 1.7136 0.5400 0.3338 1.2695 5.1778 134.5949 5.8324 43.1719 4.4643 1.7941 2.7253 23.9099 22.6465 0.8005 10.9797 10.5399 4.9860 45.1176 3.1973 0.6307 40.1199 16.4592 32.0455 3.3185 28.4166 67.3649 1.3332 50.6903 4.7479 33.4584 9.6535 3.8554 3.3577 0.2544 3.4402 2.3708 4.6843 84.1774 7.6910 4.5972 63.8262 123.3039 19.9292 1.0284 31.2721 13.4560 15.3932 11.1365 8.6834 10.6525 13.3805 2.0390 50.5297 99.4447 19.3183 54.5073 65.7356 17.1895 50.7426 19.8367 21.3465 7.0589 27.6301 8.4029 2.5084 18.2020 4.2760 1.7235 26.3561 5.2287
temp: 298.150 k
press: 1.00000 atm
elementType: 8 8 6 6 6 6 6 6 6 6 6 6 6 1 1 1 1 1 1 1 1 1 1 1 1 1 1
symmnumber: 1
zpe: 585276.1 jmol-1
zpe.correction: 0.222920 hartree
zpe.thermalcorrener: 0.235812 hartree
zpe.thermalcorrenthalpy: 0.236756 hartree
zpe.thermalcorrgfe: 0.183020 hartree
zpe.sumelectzpe: -576.981299 hartree
zpe.sumelectthermal: -576.968407 hartree
zpe.sumelectthermalent: -576.967463 hartree
zpe.sumelectthermalfe: -577.021199 hartree
dipole: -1.0537 -3.1235 1.0806
dipole: 3.4690
quadrupole: -73.9102 -75.4712 -76.3622
quadrupole: 2.3980 0.4199 -0.5580
quadrupole: 1.3376 -0.2233 -1.1143 2.3980 0.4199 -0.5580
hfenergy: -577.2042189 hartree
pointgroup: C01 [X(C11H14O2)]
dipole: -0.39549 0.1659044 -1.2956873 debye
polarizability: 174.435576|3.0453723|83.7029811|5.9188462|-16.3884705|114.831734 unknown
InChI: InChI=1S/C11H14O2/c1-13-10-6-4-9(5-7-10)11(12)8-2-3-8/h4-8,11-12H,2-3H2,1H3
charge 0 multiplicity 1
27 atoms
O  2.348285 -1.181689 1.5635
O  -3.827876 -0.18515 0.100424
C  2.740164 -0.046585 -0.608947
C  3.168539 1.298285 -1.228372
C  4.204783 0.393312 -0.547589
C  1.92311 -0.065515 0.675473
C  0.406137 -0.098892 0.456451
C  -0.44409 -0.48118 1.531394
C  -0.193353 0.266159 -0.771276
C  -1.840899 -0.49919 1.383033
C  -1.598177 0.253162 -0.939391
C  -2.424548 -0.131968 0.143336
C  -4.478694 0.189517 -1.156927
H  2.494756 -0.853265 -1.312352
H  2.866742 2.214355 -0.709961
H  3.189234 1.385197 -2.318755
H  4.927676 -0.129395 -1.180064
H  4.596991 0.694709 0.428251
H  2.195217 0.820087 1.282801
H  2.110481 -2.033811 1.114209
H  0.010554 -0.769402 2.485067
H  0.437939 0.574712 -1.610976
H  -2.500208 -0.792631 2.205777
H  -2.026864 0.541432 -1.90405
H  -4.17339 -0.480466 -1.984427
H  -4.255501 1.239719 -1.429051
H  -5.556306 0.076893 -0.967676
