program: Gaussian 09
title: 000110882
version: EM64L-G09RevD.01
frameworkgroup: C1[X(C17H26N2O)]
method: RPBEPBE
basis: SDD
operation: Freq
keyword: #p
keyword: freq=noraman
keyword: PBEPBE/SDD
title: #p freq=noraman PBEPBE/SDD
converged: YES YES NO NO
title: Mulliken charges:
elementType: O N N C C C C C C C C C C C C C C C C C H H H H H H H H H H H H H H H H H H H H H H H H H H
charge: -0.285062 -0.398087 -0.120442 -0.192297 -0.466236 -0.572753 0.245641 0.282000 -0.422013 -0.409458 -0.533322 -0.398852 0.252649 -0.357998 -0.231007 -0.227283 -0.317342 -0.310990 -0.676103 -0.675985 0.273049 0.236062 0.231072 0.229097 0.232655 0.303371 0.252312 0.263321 0.194633 0.239771 0.205725 0.240394 0.199048 0.190916 0.226779 0.226071 0.219370 0.184362 0.203266 0.185499 0.207992 0.203831 0.228876 0.207361 0.206191 0.223917
chargesum: 0.00000
title: Mulliken charges with hydrogens summed into heavy atoms:
elementType: O N N C C C C C C C C C C C C C C C C C
charge: -0.285062 -0.094715 -0.120442 0.080752 0.000898 -0.111001 0.245641 0.282000 -0.169702 -0.169064 -0.075368 0.046643 0.252649 0.031966 -0.004228 -0.001212 0.086390 0.077775 -0.035404 -0.038517
polarizability: 2.47256733e+02 2.18164162e+01 1.81568893e+02 -1.47211014e+01 1.02149781e+01 1.73859726e+02
1716.lowfreq: -10.5258 -4.3758 -0.0007 0.0002 0.0003 5.8025 10.8310 16.3974 24.2694
frequency: -1.9862 16.0633 23.9133 28.3850 47.3284 51.8955 73.4365 86.3019 108.1396 118.3591 160.1255 179.7302 197.5825 203.3083 209.9422 250.8698 271.6766 292.0608 300.7473 316.8240 342.5050 394.4151 422.9236 428.7638 456.7446 462.3434 497.4575 530.4085 543.4923 557.4980 581.9452 599.0146 673.8646 698.4403 706.0593 721.0675 761.0941 772.7690 785.7884 794.3148 803.1933 828.2248 841.1376 875.8858 880.6900 904.0952 917.8677 936.1742 946.4928 969.4040 987.6788 989.0951 1021.0437 1021.3782 1037.3889 1050.0772 1059.8697 1072.5614 1073.8206 1084.4499 1085.2810 1093.7060 1116.5336 1133.2197 1152.8693 1159.0586 1168.8073 1182.6881 1191.0176 1203.0454 1209.2761 1211.0333 1250.4462 1254.1702 1272.5799 1276.4055 1283.5287 1289.7586 1291.1849 1307.9762 1322.4695 1342.4470 1356.1697 1361.4153 1366.7659 1376.2828 1383.7855 1387.9895 1389.1178 1447.3546 1448.7035 1455.9536 1459.3737 1460.7300 1464.2860 1467.0097 1470.1158 1472.8612 1476.4662 1478.6966 1481.5967 1488.8879 1491.0973 1595.1492 1603.7087 1616.2001 2850.6816 2853.6032 2866.9171 2963.1459 2979.0495 2981.0184 2983.1763 2993.9779 3015.1413 3017.5919 3023.3809 3034.6945 3041.2376 3041.7510 3047.3308 3060.4562 3073.8125 3076.2346 3088.0355 3091.7571 3092.5483 3120.0379 3128.2441 3141.1458 3159.7320 3542.5950
redmass: 3.6404 4.0101 3.8657 4.9446 4.4168 3.6328 1.8995 2.3036 2.4098 3.5229 2.6425 2.0243 1.8965 2.1140 1.5196 3.0777 3.6917 1.9041 2.2535 2.5476 2.6812 3.0944 2.7141 2.8420 3.0373 2.5716 3.2706 1.7801 3.5273 2.3185 4.0194 2.7473 3.0666 2.2392 4.8534 3.3038 1.2781 2.3443 1.3557 1.1424 1.3178 2.9927 3.6043 1.3526 2.2376 2.0870 2.0185 1.9974 1.5507 3.2440 2.1682 1.4021 2.2460 2.2777 2.5725 2.0241 2.3131 2.1064 2.0286 2.2003 2.1770 2.2180 1.9390 1.3946 1.2195 1.6885 1.0792 1.6649 1.8449 1.9941 1.7011 1.7740 1.5041 1.3082 1.2180 1.9402 1.1616 1.3036 1.3758 1.3252 1.4856 1.3140 1.5583 1.3313 1.3172 1.3690 1.2381 6.8208 1.2343 2.3304 1.1100 1.2044 1.1187 1.7376 1.0536 1.0787 1.1491 1.0671 2.1510 1.0598 1.0497 1.0764 1.0794 6.9163 6.1993 7.0522 1.0723 1.0719 1.0710 1.0586 1.0650 1.0355 1.0357 1.0633 1.0666 1.0950 1.0907 1.0870 1.0875 1.0881 1.0915 1.1002 1.0981 1.0977 1.1003 1.1002 1.1021 1.0853 1.0893 1.0948 1.1004 1.0779
irintensity: 0.1565 0.5134 1.6180 4.0804 1.1009 0.7356 0.1536 0.4482 2.1055 1.0578 2.3918 2.0970 0.7494 2.5163 4.9414 18.4894 2.9134 1.1481 1.0263 2.2939 0.4515 0.7868 4.6504 7.1577 9.3964 2.5910 15.9373 32.2165 2.8290 39.9056 3.6562 7.7771 1.1161 14.5471 1.4721 3.4714 77.3246 3.9727 0.5153 6.9008 15.2204 6.4478 1.5835 0.3586 3.7029 7.3952 3.5324 3.5237 4.2546 1.4839 3.3434 0.5379 9.1120 2.8382 4.1039 3.9969 30.1915 13.7671 26.8337 1.4112 5.0137 13.7308 15.0336 13.9964 2.3401 6.8483 1.7014 15.9588 59.2928 37.5991 2.2685 36.6517 56.8290 2.0701 5.9393 1.4881 7.7749 16.4420 20.8074 8.1358 3.2722 13.0429 25.9243 10.9502 3.5725 1.4558 18.1461 1.2347 22.8689 9.7888 12.3262 11.9921 50.9875 340.4299 4.5669 8.8852 34.7781 9.5761 14.7892 6.6864 9.9784 21.7966 10.4648 9.4231 154.2467 3.2038 33.0945 31.6893 306.4042 28.6512 29.8451 32.0117 29.6579 37.2666 19.7246 24.2142 9.6859 12.3424 5.5719 10.7548 32.2533 37.0603 54.3953 75.2296 40.9166 59.1313 28.0772 2.6427 4.3095 32.3038 32.4106 15.8464
temp: 298.150 k
press: 1.00000 atm
elementType: 8 7 7 6 6 6 6 6 6 6 6 6 6 6 6 6 6 6 6 6 1 1 1 1 1 1 1 1 1 1 1 1 1 1 1 1 1 1 1 1 1 1 1 1 1 1
symmnumber: 1
zpe: 1046927.7 jmol-1
zpe.correction: 0.398754 hartree
zpe.thermalcorrener: 0.419068 hartree
zpe.thermalcorrenthalpy: 0.420012 hartree
zpe.thermalcorrgfe: 0.346913 hartree
zpe.sumelectzpe: -846.600904 hartree
zpe.sumelectthermal: -846.580590 hartree
zpe.sumelectthermalent: -846.579646 hartree
zpe.sumelectthermalfe: -846.652745 hartree
dipole: -0.2355 -2.4306 2.2686
dipole: 3.3331
quadrupole: -107.4733 -121.3852 -122.4417
quadrupole: -0.8472 -3.3487 6.5728
quadrupole: 9.6268 -4.2851 -5.3416 -0.8472 -3.3487 6.5728
hfenergy: -846.9996579 hartree
pointgroup: C01 [X(C17H26N2O1)]
dipole: 0.0731996 -1.2625595 -0.3467426 debye
polarizability: 246.1888199|-27.5681768|172.7134853|-1.6821302|-9.5818932|183.7830464 unknown
InChI: InChI=1S/C17H26N2O/c1-3-19(4-2)13-7-10-17(20)18-16-12-11-14-8-5-6-9-15(14)16/h5-6,8-9,16,18H,3-4,7,10-13H2,1-2H3
charge 0 multiplicity 1
46 atoms
O  -0.530333 1.984838 0.667849
N  0.803796 0.184646 0.058628
N  -4.625361 -0.221073 -0.080548
C  2.049381 0.98439 0.007606
C  2.37722 1.566561 -1.410004
C  3.377515 0.567186 -2.069469
C  3.261912 0.10787 0.305868
C  4.013263 -0.132704 -0.873444
C  3.64918 -0.457169 1.538606
C  5.170293 -0.938268 -0.825079
C  -1.616726 -0.204128 0.353771
C  -2.645297 0.11308 1.459702
C  -0.421003 0.749532 0.383244
C  -3.999339 -0.590786 1.217843
C  4.812621 -1.262764 1.587844
C  5.56798 -1.500413 0.412783
C  -5.242305 1.135292 -0.05021
C  -5.563272 -1.262968 -0.580913
C  -5.331939 1.7868 -1.443619
C  -4.844335 -2.483214 -1.188455
H  1.901789 1.801022 0.736247
H  1.460458 1.728149 -2.000335
H  2.869549 2.547478 -1.278549
H  2.85403 -0.165763 -2.715791
H  4.120575 1.078771 -2.707478
H  0.856949 -0.812156 -0.1606
H  3.063734 -0.269365 2.446115
H  -2.142769 -0.084643 -0.615927
H  -1.283634 -1.259745 0.414002
H  -2.768605 1.210717 1.50053
H  -2.256462 -0.194547 2.45067
H  5.7598 -1.125922 -1.730279
H  -4.682938 -0.372386 2.077078
H  -3.83707 -1.685278 1.216542
H  5.135587 -1.700616 2.5391
H  6.469321 -2.122007 0.464894
H  -4.615559 1.777945 0.593512
H  -6.256919 1.10534 0.423012
H  -6.190777 -0.801891 -1.365017
H  -6.263591 -1.598763 0.226343
H  -5.780115 2.795323 -1.369095
H  -5.95349 1.195249 -2.140442
H  -4.323334 1.881931 -1.881822
H  -5.580565 -3.214842 -1.571123
H  -4.212205 -3.003694 -0.446047
H  -4.19591 -2.163618 -2.023137
