program: Gaussian 09
title: 000001865
version: EM64L-G09RevD.01
frameworkgroup: C1[X(C8H12N2O3)]
method: RPBEPBE
basis: SDD
operation: Freq
keyword: #p
keyword: freq=noraman
keyword: PBEPBE/SDD
title: #p freq=noraman PBEPBE/SDD
converged: NO NO NO NO
title: Mulliken charges:
elementType: O O O N N C C C C C C C C H H H H H H H H H H H H
charge: -0.445645 -0.251808 -0.248782 -0.417857 -0.387695 -0.545624 0.352916 -0.355811 0.093862 -0.320214 0.131612 -0.793110 0.124082 0.233799 0.207698 0.231164 0.244701 0.339801 0.190678 0.186623 0.263853 0.248003 0.208884 0.360582 0.348289
chargesum: 0.00000
title: Mulliken charges with hydrogens summed into heavy atoms:
elementType: O O O N N C C C C C C C C
charge: -0.097356 -0.251808 -0.248782 -0.078056 -0.027113 -0.104127 0.352916 0.120055 0.093862 0.057087 0.131612 -0.072371 0.124082
polarizability: 1.34816161e+02 -2.30761213e+00 1.28724718e+02 1.04403959e+01 -3.56224432e+00 7.09861640e+01
1716.lowfreq: -48.9668 -10.4108 0.0005 0.0007 0.0010 5.0851 9.1162 28.1811 62.5948
frequency: -48.4694 27.6385 62.5854 74.8068 106.3517 111.9437 165.7121 196.4138 242.1653 273.2451 303.0779 318.9426 326.9115 369.4816 407.8880 455.5744 523.4710 591.7298 602.1774 623.7163 657.9812 709.1932 730.7617 750.2193 777.6086 778.9434 867.8091 924.6498 965.9631 984.3689 1009.2620 1038.6270 1047.2724 1070.3829 1119.5134 1162.5990 1173.0643 1210.2826 1222.6742 1255.7388 1278.1542 1284.7621 1295.9087 1342.1228 1353.5017 1386.0211 1405.7536 1419.8221 1449.2514 1461.9800 1469.4765 1474.0202 1484.3393 1498.6656 1612.2701 1648.5786 1684.3681 2924.4734 2971.4086 2980.6597 2984.5264 3012.2659 3045.2376 3064.3613 3080.7616 3101.5469 3532.2974 3555.3446 3570.8482
redmass: 1.0439 4.8628 6.2629 1.8648 3.7771 3.3115 8.5461 4.7263 4.3394 1.0841 3.6714 4.1484 2.6003 7.2671 4.5648 7.0047 6.8611 4.2617 4.6503 1.2310 3.9918 2.8332 3.4884 2.9851 2.3178 1.3017 1.2981 2.2944 3.5987 4.3156 3.4849 1.7185 2.0381 1.6583 2.1917 1.3347 4.2780 1.2370 3.1996 2.0536 1.3162 1.1660 1.5179 1.4546 1.8668 2.5549 1.2393 1.4283 1.2240 2.1837 1.0838 1.0785 1.0824 1.0973 6.9878 6.4120 5.6779 1.0545 1.1068 1.0638 1.0398 1.0607 1.0958 1.0934 1.1047 1.0997 1.0771 1.0777 1.0666
irintensity: 0.0992 2.4207 0.8766 8.9143 1.1949 0.4975 4.5102 2.2140 0.3319 158.0864 2.2350 3.5600 4.3830 14.5497 26.3824 15.4289 4.2031 3.0699 2.4159 65.6276 3.3515 3.4737 35.2248 6.8516 125.6457 15.9181 1.8441 8.4647 34.4055 59.0585 6.8291 4.6134 12.3509 15.5514 22.0120 10.0018 19.4390 31.6933 10.7133 16.0455 26.3133 7.0440 12.0815 2.6687 29.0290 108.3354 18.5118 6.2421 25.0043 49.0081 1.2569 1.1149 2.0615 24.9705 190.6457 280.6008 708.6324 70.5018 52.8031 33.0116 22.6815 19.4367 5.8043 16.5520 40.3445 13.4506 58.3996 58.4748 3.6879
temp: 298.150 k
press: 1.00000 atm
elementType: 8 8 8 7 7 6 6 6 6 6 6 6 6 1 1 1 1 1 1 1 1 1 1 1 1
symmnumber: 1
zpe: 524045.0 jmol-1
zpe.correction: 0.199598 hartree
zpe.thermalcorrener: 0.212400 hartree
zpe.thermalcorrenthalpy: 0.213345 hartree
zpe.thermalcorrgfe: 0.159113 hartree
zpe.sumelectzpe: -646.264607 hartree
zpe.sumelectthermal: -646.251805 hartree
zpe.sumelectthermalent: -646.250860 hartree
zpe.sumelectthermalfe: -646.305092 hartree
dipole: 6.1183 -0.4050 3.1393
dipole: 6.8886
quadrupole: -74.8136 -89.0193 -79.0926
quadrupole: -1.8010 6.6778 -0.1572
quadrupole: 6.1615 -8.0441 1.8826 -1.8010 6.6778 -0.1572
hfenergy: -646.4642051 hartree
pointgroup: C01 [X(C8H12N2O3)]
dipole: 2.4149181 -0.074031 1.2279209 debye
dipolederiv: -0.5961602 0.0010432 0.3267676 -0.017085 -0.5718177 -0.0170776 0.4319409 -0.0245662 -0.5010881 -0.8578996 0.4115446 -0.1541109 0.3130225 -0.9378859 0.124089 -0.1848914 0.174011 -0.4250376 -0.6940738 -0.4014927 -0.0499509 -0.4287413 -1.3038402 -0.0426198 -0.0671809 -0.0630945 -0.4036704 -0.886412 -0.7153043 -0.0977258 0.0277178 -0.8995871 0.0523444 -0.1781495 -0.1988437 -0.3060221 -0.399193 0.0133798 -0.0062615 -0.0682392 -1.2722909 0.0651501 -0.0078346 0.071188 -0.348137 -0.1992778 -0.0388353 0.0043211 -0.0354457 0.1483093 -0.0188721 0.1179694 -0.0672848 0.1169941 0.5780593 0.1308751 0.0855866 -0.2746127 0.9559543 -0.1325841 0.1739521 0.020678 0.0239516 -0.0983629 0.0276692 -0.0223297 0.0262017 0.0900429 0.0267051 -0.2084218 0.0456019 0.0326341 -0.7520596 0.4590098 -0.1761898 0.2150048 -0.1081141 0.0494686 -0.2458026 0.0905196 -0.170957 0.5911359 -0.0070812 -0.2399957 0.0002288 0.4379351 0.0006682 -0.1746861 -0.011159 0.4777489 1.2888182 -0.3692215 0.2972398 -0.1015144 1.3626057 -0.1211339 0.3395058 -0.2049943 0.3460326 0.0321259 -0.0409815 -0.0004509 -0.0092819 -0.0914492 -0.0018008 0.018445 0.0458162 0.0710702 1.2755055 0.5803975 0.2371842 0.3690814 1.7874248 -0.0184283 0.2863394 0.0857862 0.3916156 0.0458441 -0.021127 -0.0226506 -0.0390773 -0.0286475 -0.1284154 -0.0154403 -0.067876 0.0073375 0.0427025 0.0177054 -0.0132006 0.0373417 -0.0990003 0.1430258 -0.0178138 0.0865687 0.0046049 0.0576777 -0.053086 -0.0186269 -0.026939 -0.0364152 -0.1041024 -0.0337652 -0.0798502 -0.0034779 0.0701966 0.0399379 -0.0134641 0.0247318 -0.050488 0.0917108 -0.0413521 0.0801976 0.0185551 0.213301 -0.0247289 -0.0438329 -0.0055422 0.205884 -0.0053281 -0.0488314 -0.0024711 0.2929705 -0.0087262 -0.028559 0.0096611 -0.0472543 -0.1025103 -0.1578503 0.0148962 -0.1121603 -0.1212759 -0.00833 0.021777 0.0248654 0.0414941 -0.1374405 0.15707 0.0239247 0.1129887 -0.0951403 0.0279974 0.1103908 0.0654822 0.0356014 0.0191278 -0.0452295 0.0402496 -0.0488712 0.0924471 0.0808155 -0.0661534 0.0465326 -0.0481083 0.0196202 0.0299492 0.0683273 0.0739267 -0.0675172 -0.0728027 -0.0574945 -0.1174634 -0.0034676 0.0803815 0.0279333 -0.1247928 -0.0290856 0.0134209 0.2381105 -0.0080333 -0.035121 -0.001351 0.1392803 0.0132848 -0.0327124 0.0103305 0.3250147 0.0310077 0.0183681 -0.0862661 0.0162342 0.3929212 0.0120431 -0.1338753 0.0126437 0.2279258 unknown
polarizability: 134.9940633|-1.8974451|128.3924961|10.3103374|-4.9856554|71.1404837 unknown
InChI: InChI=1S/C8H12N2O3/c1-5-6(3-2-4-11)9-8(13)10-7(5)12/h9-11H,2-4H2,1H3
charge 0 multiplicity 1
25 atoms
O  4.763403 -0.116163 -1.022769
O  -2.781471 1.948015 -0.55454
O  -2.398804 -2.696956 -0.099591
N  -0.562928 -1.330604 0.40939
N  -2.557727 -0.358694 -0.318777
C  1.50969 -0.117508 0.955899
C  0.057748 -0.076263 0.521461
C  2.487893 -0.082447 -0.251402
C  -0.640454 1.076455 0.205516
C  3.950248 -0.151648 0.200425
C  -2.040376 0.969214 -0.243793
C  -0.06595 2.472297 0.263226
C  -1.887705 -1.549619 -0.013543
H  1.720312 0.738352 1.6221
H  1.694633 -1.03331 1.553483
H  2.285958 -0.928067 -0.934857
H  2.337098 0.845587 -0.831613
H  -0.045526 -2.178607 0.648947
H  4.186166 0.711064 0.86237
H  4.130685 -1.089033 0.772654
H  -0.83228 3.174256 0.633903
H  0.217737 2.827582 -0.745866
H  0.824689 2.539321 0.909817
H  -3.528944 -0.451709 -0.631424
H  5.724307 -0.158416 -0.787815
