program: Gaussian 09
title: 000110862
version: EM64L-G09RevD.01
frameworkgroup: C1[X(C6H13NO)]
method: RPBEPBE
basis: SDD
operation: Freq
keyword: #p
keyword: freq=noraman
keyword: PBEPBE/SDD
title: #p freq=noraman PBEPBE/SDD
converged: YES YES YES YES
title: Mulliken charges:
elementType: O N C C C C C C H H H H H H H H H H H H H
charge: -0.289858 -0.255331 0.052369 0.052369 -0.444113 -0.444114 -0.719595 -0.719596 0.173382 0.173382 0.214900 0.214869 0.214869 0.214901 0.248646 0.233202 0.223249 0.200010 0.200010 0.223249 0.233202
chargesum: 0.00000
title: Mulliken charges with hydrogens summed into heavy atoms:
elementType: O N C C C C C C
charge: -0.289858 -0.006686 0.225751 0.225751 -0.014344 -0.014344 -0.063135 -0.063135
polarizability: 8.85610517e+01 2.51007343e-06 7.14490654e+01 4.37844561e-06 -1.41946900e+00 6.32776173e+01
1716.lowfreq: -10.5443 -0.0010 -0.0008 0.0000 14.3820 17.4398 140.8859 149.7601 188.0045
frequency: 140.8777 149.7568 187.9977 200.4523 234.4810 286.8603 335.8526 422.5848 428.0145 459.4595 464.0541 568.0995 647.5396 774.7154 827.1375 880.5336 883.9129 935.1273 938.5239 971.8390 1039.9031 1095.4361 1099.8004 1115.7421 1140.2940 1147.9394 1164.6640 1205.1233 1286.1926 1290.8401 1299.8176 1309.0256 1345.1185 1353.6685 1365.0588 1385.2481 1388.1878 1429.6491 1435.1420 1449.4361 1458.5587 1458.8367 1478.2933 1479.7515 2894.1460 2902.2566 2980.7958 2982.8945 2988.2952 2989.3743 3050.3798 3052.4373 3085.6919 3086.1001 3095.6439 3096.0895 3425.4623
redmass: 2.1531 2.1753 1.0217 1.2526 2.6195 1.9478 2.4137 4.9691 3.1683 2.4004 2.5309 2.1569 1.6418 2.7763 2.5975 1.4185 1.8218 2.2277 2.2643 1.6829 1.9350 2.4589 2.2148 2.3706 3.4770 2.3659 2.0478 1.2850 1.2450 1.1797 1.3390 1.3217 1.3667 1.1754 1.5252 1.2363 1.2913 1.0730 1.0980 1.1753 1.0520 1.0499 1.0496 1.0493 1.0835 1.0830 1.0581 1.0578 1.0366 1.0390 1.1037 1.1038 1.0993 1.0991 1.1000 1.0999 1.0744
irintensity: 0.1470 4.0400 0.0413 0.5172 1.0075 19.8505 0.3279 1.1241 0.6565 2.6718 1.9884 2.6881 194.0218 11.2706 10.9751 0.1858 20.1479 25.6727 0.2850 2.2221 81.8178 19.8602 8.4590 3.1102 19.9045 6.7136 5.8341 0.0934 1.5715 31.5543 3.3606 4.6002 1.0601 4.9761 1.4107 28.7006 15.8419 6.4272 4.2066 11.8837 0.1457 23.5363 3.6540 12.1462 5.9720 123.2610 41.1352 33.1981 63.6243 13.8099 22.9205 40.0467 25.5489 53.0412 0.2807 58.8709 2.0365
temp: 298.150 k
press: 1.00000 atm
elementType: 8 7 6 6 6 6 6 6 1 1 1 1 1 1 1 1 1 1 1 1 1
symmnumber: 1
zpe: 488011.3 jmol-1
zpe.correction: 0.185874 hartree
zpe.thermalcorrener: 0.194585 hartree
zpe.thermalcorrenthalpy: 0.195529 hartree
zpe.thermalcorrgfe: 0.153276 hartree
zpe.sumelectzpe: -365.723546 hartree
zpe.sumelectthermal: -365.714834 hartree
zpe.sumelectthermalent: -365.713890 hartree
zpe.sumelectthermalfe: -365.756143 hartree
dipole: 0.0000 0.3826 -1.5120
dipole: 1.5596
quadrupole: -45.2272 -56.9065 -48.4096
quadrupole: 0.0000 0.0000 -2.2724
quadrupole: 4.9539 -6.7254 1.7715 0.0000 0.0000 -2.2724
hfenergy: -365.9094193 hartree
pointgroup: C01 [X(C6H13N1O1)]
dipole: 0.0000112 0.1356198 0.5984276 debye
dipolederiv: -1.0836802 0.0000244 0.000006 0.0000247 -0.5053132 0.0415382 0.0000071 0.0383608 -0.3961704 -0.5233999 -0.0000125 0.0000051 -0.0000128 -0.8644275 0.0366306 0.0000099 0.1998157 -0.1214799 0.62819 0.036876 0.0598819 0.2127063 0.2648056 -0.0086881 0.1445874 0.0022257 0.3932637 0.628167 -0.0369054 -0.0598857 -0.2127361 0.2648284 -0.0086795 -0.1445898 0.0022386 0.3932663 0.2895871 -0.0654014 -0.0356948 -0.1229296 0.2470959 0.0067223 -0.1434738 0.0039091 0.2074112 0.2896028 0.0653972 0.0356924 0.1229239 0.2470806 0.0067174 0.1434703 0.0038975 0.2074078 -0.090769 0.0617993 0.0455317 0.1181178 -0.0454162 -0.0132298 0.0261713 -0.0105478 0.0555619 -0.0907856 -0.061796 -0.0455304 -0.1181142 -0.0454003 -0.0132246 -0.0261695 -0.0105436 0.0555618 -0.0406577 -0.0081304 0.0483479 -0.0491131 -0.0026346 -0.038622 -0.055458 -0.0188395 -0.2577344 -0.0406529 0.0081327 -0.0483547 0.0491158 -0.0026398 -0.038621 0.0554527 -0.0188462 -0.2577345 -0.1338723 -0.0904802 -0.0479905 -0.1112542 -0.0006855 -0.0294461 -0.0952351 -0.0477776 0.0604571 0.0632104 0.0265089 -0.0024443 0.0518248 0.0368278 -0.034122 0.0679281 0.0021087 -0.1592108 0.0632044 -0.0265105 0.0024418 -0.0518268 0.0368341 -0.0341225 -0.0679277 0.0021138 -0.1592089 -0.1338542 0.0904903 0.0479889 0.1112653 -0.000703 -0.0294506 0.0952319 -0.0477854 0.0604564 0.0593564 0.0000116 0.0000023 0.0000123 0.3609367 0.0660003 -0.0000052 -0.1268801 -0.0673998 0.0933401 -0.0068445 0.0130727 0.0516825 -0.1366175 0.0723306 0.0115994 0.0793397 0.0636384 0.0933875 0.0058979 -0.0338775 0.0163753 0.0912317 0.017472 0.0350365 -0.0272453 -0.1441121 -0.1285558 -0.0621881 -0.0481269 -0.1126033 0.0497965 -0.0445006 -0.0636835 -0.0388182 0.0732502 -0.1285395 0.0622034 0.0481245 0.1126189 0.0497798 -0.0445053 0.0636809 -0.0388237 0.0732508 0.0933862 -0.0058978 0.0338768 -0.0163757 0.0912335 0.0174658 -0.0350407 -0.0272456 -0.1441116 0.0933352 0.0068251 -0.0130673 -0.0517018 -0.1366129 0.0723348 -0.0115921 0.0793433 0.0636367 unknown
polarizability: 88.5610517|-0.0006629|71.3730559|-0.0001323|1.6217959|63.3536267 unknown
InChI: InChI=1S/C6H13NO/c1-5-3-7-4-6(2)8-5/h5-7H,3-4H2,1-2H3
charge 0 multiplicity 1
21 atoms
O  -0.000065 -1.044114 -0.100083
N  0.000055 1.857681 0.145183
C  1.232928 -0.344393 0.340808
C  -1.232993 -0.344294 0.340826
C  1.228379 1.104755 -0.209982
C  -1.228335 1.104853 -0.209971
C  2.406024 -1.188243 -0.158653
C  -2.406166 -1.188051 -0.15861
H  1.231159 -0.302439 1.457089
H  -1.231202 -0.302332 1.457106
H  2.11064 1.65838 0.162743
H  1.297523 1.058401 -1.314815
H  -1.297485 1.058498 -1.314803
H  -2.110547 1.658553 0.162757
H  0.00007 2.137128 1.137034
H  2.341248 -2.213647 0.243771
H  2.390096 -1.250728 -1.261431
H  3.369012 -0.74599 0.156473
H  -3.369113 -0.74571 0.156518
H  -2.390254 -1.250553 -1.261387
H  -2.341474 -2.213455 0.243827
