program: Gaussian 09
title: 000110857
version: EM64L-G09RevD.01
frameworkgroup: C1[X(C6H15NO2)]
method: RPBEPBE
basis: SDD
operation: Freq
keyword: #p
keyword: freq=noraman
keyword: PBEPBE/SDD
title: #p freq=noraman PBEPBE/SDD
converged: YES YES NO NO
title: Mulliken charges:
elementType: O O N C C C C C C H H H H H H H H H H H H H H H
charge: -0.479240 -0.449126 -0.332763 -0.035961 -0.431417 -0.065537 -0.316573 -0.661659 -0.720539 0.189455 0.240559 0.188493 0.189266 0.255520 0.208516 0.227145 0.197408 0.210221 0.243343 0.206617 0.220084 0.223462 0.339482 0.353243
chargesum: 0.00000
title: Mulliken charges with hydrogens summed into heavy atoms:
elementType: O O N C C C C C C
charge: -0.139758 -0.095883 -0.077243 0.153495 -0.002365 0.123730 0.119088 -0.010687 -0.070376
polarizability: 9.34591714e+01 -2.65384777e+00 7.77893163e+01 -2.43338684e+00 6.35004746e-01 7.09878396e+01
1716.lowfreq: -19.9782 -13.1231 -0.0007 0.0004 0.0006 10.3243 36.2891 52.1745 90.5727
frequency: 35.8632 51.9000 90.5603 138.2220 195.2170 216.0816 248.3638 248.7472 278.4011 296.6139 314.3411 373.9667 421.8890 434.0000 486.1260 510.3887 597.3537 640.3037 806.0194 816.7994 902.1217 917.2868 922.9847 946.9258 959.2500 1004.3590 1050.2341 1080.5939 1100.9316 1139.8077 1140.9529 1159.2044 1182.8168 1226.4787 1250.4124 1282.0330 1314.7822 1327.6750 1333.9112 1371.5107 1377.3537 1381.4005 1386.4158 1391.8418 1449.1371 1455.6490 1462.1196 1470.3742 1476.2723 1480.6068 1490.8520 2848.9852 2863.7533 2962.2408 2972.7428 2976.9453 2985.5456 3054.6798 3064.6764 3075.7714 3080.4161 3089.2557 3104.1685 3462.7955 3521.2158 3566.2891
redmass: 3.7561 3.2586 2.9813 4.4728 2.7041 1.0414 2.1746 1.2085 1.9218 1.6331 2.2039 2.2838 2.1354 2.3146 1.6186 1.6219 1.5136 3.1912 2.4355 3.0422 2.4751 1.3056 1.8269 1.7600 1.9568 2.1026 2.2739 2.0878 2.2225 2.2024 1.1272 1.7605 2.0102 1.3462 1.2341 1.1798 1.3342 1.3072 1.3918 1.2783 1.2328 1.3094 1.6396 1.2195 1.1946 1.0760 1.0709 1.0526 1.0884 1.0711 1.0619 1.0725 1.0818 1.0794 1.0360 1.0358 1.0739 1.0877 1.0990 1.0998 1.1000 1.0989 1.0956 1.0749 1.0647 1.0660
irintensity: 1.6433 0.8546 0.6831 7.9969 6.8321 0.3567 6.5983 0.5052 50.9151 45.4227 46.4154 7.9916 10.4345 38.6920 72.9404 140.2228 35.8921 46.2449 6.6201 10.7095 22.1313 6.7321 14.0639 27.5672 10.9372 18.9654 94.6827 28.9775 7.9750 11.5606 30.2088 26.1515 56.9908 11.5134 12.3035 9.1521 8.2273 31.1600 30.8762 26.9418 5.5579 23.0922 15.1937 25.3851 17.7954 1.1322 8.1867 2.6450 6.3220 16.7823 9.5463 100.5168 120.0926 31.5436 37.3406 19.2098 102.8053 13.4202 36.2866 26.0684 33.8262 52.9508 13.3074 0.6875 10.7124 3.0802
temp: 298.150 k
press: 1.00000 atm
elementType: 8 8 7 6 6 6 6 6 6 1 1 1 1 1 1 1 1 1 1 1 1 1 1 1
symmnumber: 1
zpe: 551878.8 jmol-1
zpe.correction: 0.210200 hartree
zpe.thermalcorrener: 0.221895 hartree
zpe.thermalcorrenthalpy: 0.222840 hartree
zpe.thermalcorrgfe: 0.172570 hartree
zpe.sumelectzpe: -442.031491 hartree
zpe.sumelectthermal: -442.019795 hartree
zpe.sumelectthermalent: -442.018851 hartree
zpe.sumelectthermalfe: -442.069121 hartree
dipole: -1.5061 -3.4187 -0.5121
dipole: 3.7707
quadrupole: -58.4962 -57.1148 -54.8295
quadrupole: -3.3946 -1.1911 1.2100
quadrupole: -1.6827 -0.3013 1.9840 -3.3946 -1.1911 1.2100
hfenergy: -442.2416908 hartree
pointgroup: C01 [X(C6H15N1O2)]
dipole: 0.5723887 1.2886232 0.4611547 debye
dipolederiv: -0.8515385 0.2659697 -0.0246621 0.2420168 -0.3554656 0.0482719 0.0026835 0.0414904 -0.5575784 -0.437252 -0.2509477 -0.0685397 -0.2805888 -0.5123407 -0.0954342 -0.0507403 -0.0989558 -0.6849133 -0.8586327 0.127397 0.1199959 0.092079 -0.4290403 0.1569718 0.0403507 0.147482 -0.4093309 0.5653061 -0.063116 -0.1851579 -0.1345254 0.3705196 0.0152055 -0.3130338 0.0156657 0.3745838 0.3946165 -0.1057398 0.0954341 -0.11822 0.3429063 -0.0464515 0.1795033 -0.1065256 0.0779372 0.5190416 -0.1696559 0.0677824 -0.2137546 0.2339702 -0.0735697 0.0639809 -0.0365463 0.3938344 0.2600868 0.0615722 0.0279145 0.139616 0.2274691 0.0633464 -0.0216715 0.0146792 0.5432901 -0.0036181 -0.0306075 -0.0723721 0.0080592 -0.0872088 -0.0956409 0.0025005 -0.0928402 0.0055406 -0.1251158 0.0259511 -0.0539018 0.0061112 0.0795589 -0.0072098 -0.0385048 -0.0118914 0.0161704 -0.0676814 -0.0007479 0.0252412 -0.0537437 -0.1431323 0.1421415 0.1277675 0.1144779 -0.148639 0.089155 0.0204393 0.0126659 0.0303945 0.0875183 -0.0661099 0.0204797 -0.0181157 -0.0706471 -0.1049222 0.0642448 -0.0268919 0.130075 -0.3126071 0.0751325 -0.0274686 0.0414581 0.0560115 -0.0117493 0.0178027 -0.0342724 -0.0058443 -0.0015055 -0.0889224 -0.023559 -0.0348961 -0.2194769 0.0967338 0.0250399 -0.0498572 0.0107749 0.1073496 -0.1905305 -0.0320046 -0.1148919 0.1167407 -0.1130587 -0.1121738 0.1409008 -0.0872508 0.0194865 0.0175872 0.1009904 0.0279297 -0.0999712 0.0148961 0.1112322 -0.0820451 0.1113047 0.058687 0.0183584 -0.0354032 0.0044876 0.0279668 -0.1005505 0.0624231 0.15673 0.0212557 0.0566696 -0.0241517 0.1411473 -0.0518446 -0.0097477 0.1045783 -0.006933 0.0087769 -0.0062732 -0.0501037 0.0755399 -0.0038901 0.1493459 -0.0392199 -0.0352582 -0.0271955 -0.121681 -0.0063163 0.0747139 0.0046625 -0.1298745 -0.0044535 0.0293823 0.0755257 -0.0100602 -0.0212901 -0.0616847 -0.1446575 -0.1228298 -0.0563075 -0.1048585 0.0179963 -0.1070973 0.0507452 0.0720031 0.0741594 0.083709 -0.0319977 0.12385 -0.0334602 0.0254149 0.0990283 -0.0530541 0.0482579 -0.0105578 -0.0188485 0.1313845 -0.0197721 0.1002587 -0.0493806 0.3724008 -0.1574631 -0.0299247 -0.0814662 0.0126809 0.0211541 -0.0691334 0.0111726 0.3231428 0.2251055 0.1548773 -0.0051067 0.1943792 0.2996712 0.0730919 0.0181096 0.040832 0.280893 unknown
polarizability: 93.2415142|-3.6697034|76.9465075|2.2285529|2.1486243|72.0483057 unknown
InChI: InChI=1S/C6H15NO2/c1-5(2)7-3-6(9)4-8/h5-9H,3-4H2,1-2H3
charge 0 multiplicity 1
24 atoms
O  -2.767777 1.051618 -0.068759
O  -1.908314 -1.381767 -1.048635
N  0.922107 0.546963 0.624123
C  2.133806 0.227517 -0.181638
C  -0.276808 0.987986 -0.10754
C  -1.565119 0.457225 0.56402
C  -1.742567 -1.055752 0.372485
C  1.969198 -1.139367 -0.883282
C  3.361495 0.226281 0.751751
H  2.299824 1.005051 -0.96879
H  -0.246081 0.583285 -1.134836
H  -0.348023 2.102176 -0.198838
H  -1.54403 0.69676 1.649066
H  1.140903 1.148592 1.427269
H  -2.617107 -1.403053 0.959804
H  -0.832442 -1.57403 0.711772
H  2.81404 -1.327203 -1.572192
H  1.939168 -1.946935 -0.12917
H  1.031532 -1.191276 -1.465292
H  3.531744 1.224153 1.200762
H  4.272523 -0.055238 0.195303
H  3.214944 -0.504327 1.56903
H  -2.637429 2.027449 -0.173491
H  -2.625586 -0.779408 -1.381423
