program: Gaussian 09
title: 000110847
version: EM64L-G09RevD.01
frameworkgroup: C1[X(C13H16O2)]
method: RPBEPBE
basis: SDD
operation: Freq
keyword: #pfreq=noraman
keyword: PBEPBE/SDD
title: #p freq=noraman PBEPBE/SDD
converged: YES YES NO NO
title: Mulliken charges:
elementType: O O C C C C C C C C C C C C C H H H H H H H H H H H H H H H H
charge: -0.279670 -0.284000 -0.000236 -0.005902 -0.085946 -0.722730 -0.709338 -0.139818 -0.324917 0.486790 -0.380149 -0.394290 -0.234568 -0.235125 -0.240734 0.197516 0.203561 0.204843 0.238559 0.226204 0.212021 0.210079 0.240415 0.222138 0.243059 0.216431 0.226007 0.227943 0.225582 0.226831 0.229444
chargesum: 0.00000
title: Mulliken charges with hydrogens summed into heavy atoms:
elementType: O O C C C C C C C C C C C C C
charge: -0.279670 -0.284000 0.197280 0.197659 0.118897 -0.045946 -0.036706 0.103242 -0.108485 0.486790 -0.154143 -0.166347 -0.008985 -0.008294 -0.011290
polarizability: 2.54334479e+02 3.22711625e+00 1.11859011e+02 2.53159926e+00 2.14087992e+01 1.09882949e+02
1716.lowfreq: -12.0459 -7.1222 -4.0551 -0.0004 -0.0003 0.0007 14.9892 24.5705 43.1673
frequency: 14.4531 24.5164 43.1384 90.5770 99.1012 125.0438 189.0310 201.8543 212.2473 246.0774 256.7019 297.4190 317.3695 342.3915 403.9581 422.2881 497.5452 522.0231 535.7310 558.0386 593.4910 616.3482 689.7803 696.3430 756.4927 783.5970 814.5287 822.5412 846.5216 851.9653 863.3109 895.5845 925.9529 974.5846 976.2885 979.2889 987.5124 991.9699 997.7590 1027.0003 1054.9889 1075.0299 1081.2921 1119.7180 1124.1117 1149.7047 1172.7696 1173.9055 1191.3309 1223.7696 1241.7049 1252.2337 1279.6623 1295.7332 1299.0131 1324.3317 1331.4607 1356.2895 1372.7833 1388.3438 1389.6920 1391.6324 1441.2704 1459.1200 1460.7250 1474.6645 1478.0717 1486.3741 1585.1207 1612.6133 1668.6948 2942.9613 2962.6453 2971.4087 2988.6730 2992.2989 3079.1701 3084.2123 3088.7497 3099.9864 3101.1919 3118.3269 3125.9480 3133.4853 3139.5054 3150.1150 3165.4690
redmass: 3.8927 3.8254 4.1075 3.4379 4.5759 3.5205 1.1271 1.1606 2.3651 2.7852 2.8279 3.3008 3.8669 2.9810 2.7605 3.1377 3.6964 3.2841 3.6509 4.9574 4.9434 6.3999 9.3893 1.7468 1.8734 2.6971 2.5830 3.0829 1.5227 2.8387 2.7122 2.2197 1.5742 1.2490 1.2595 1.2889 5.3261 4.8954 1.3128 2.1762 2.4884 1.8857 1.6974 2.6857 2.5000 2.4473 1.0763 1.8562 1.1170 1.7475 1.2097 1.4805 1.2753 1.3522 1.1863 1.3595 1.2939 1.5078 1.9824 1.2911 1.9848 1.7296 2.2572 1.0454 1.0604 1.0468 1.0484 2.3169 5.7915 5.9870 6.1103 1.0831 1.0865 1.0864 1.0365 1.0362 1.0896 1.0986 1.0990 1.1001 1.1000 1.0870 1.0864 1.0905 1.0913 1.0958 1.1015
irintensity: 2.8785 0.5528 0.8550 0.7221 1.3322 1.5755 0.0277 0.0857 0.0939 0.1552 0.6259 1.4965 4.2908 6.2345 0.1222 2.1489 3.5990 15.7250 31.3041 4.5904 1.2384 0.0501 11.9238 49.1915 19.7444 26.7686 31.4099 10.5591 5.4760 36.9606 18.2806 31.7198 0.4038 21.0259 19.3845 26.5651 55.3934 96.2520 6.8830 6.7767 181.4755 10.2863 14.5144 7.6679 51.5550 79.2742 0.2597 12.4831 0.5775 0.7141 20.7788 1.8356 6.1522 22.4658 22.4925 1.6898 2.6544 21.6533 16.9523 19.0680 41.4328 4.1001 12.4183 18.0353 2.4729 13.3189 7.9250 22.7200 3.7114 3.0812 29.0281 38.6835 37.0483 88.7597 25.8525 28.0192 18.7181 32.1123 27.7564 1.6724 50.2233 9.0739 1.3927 13.6558 8.4929 44.2837 26.1468
temp: 298.150 k
press: 1.00000 atm
elementType: 8 8 6 6 6 6 6 6 6 6 6 6 6 6 6 1 1 1 1 1 1 1 1 1 1 1 1 1 1 1 1
symmnumber: 1
zpe: 673441.8 jmol-1
zpe.correction: 0.256500 hartree
zpe.thermalcorrener: 0.271229 hartree
zpe.thermalcorrenthalpy: 0.272173 hartree
zpe.thermalcorrgfe: 0.212244 hartree
zpe.sumelectzpe: -654.280074 hartree
zpe.sumelectthermal: -654.265345 hartree
zpe.sumelectthermalent: -654.264401 hartree
zpe.sumelectthermalfe: -654.324330 hartree
dipole: 1.1844 0.2379 0.1261
dipole: 1.2146
quadrupole: -67.6251 -91.0519 -88.5914
quadrupole: 1.5137 0.7498 9.1978
quadrupole: 14.7977 -8.6291 -6.1686 1.5137 0.7498 9.1978
hfenergy: -654.5365742 hartree
pointgroup: C01 [X(C13H16O2)]
dipole: -0.4641619 -0.0336693 -0.1085071 debye
polarizability: 254.164041|2.581682|101.863595|5.5733271|19.4977829|120.0488026 unknown
InChI: InChI=1S/C13H16O2/c1-10-11(2)15-13(14-10)9-8-12-6-4-3-5-7-12/h3-11,13H,1-2H3
charge 0 multiplicity 1
31 atoms
O  -2.325768 1.039342 -0.659099
O  -2.296649 -0.783138 0.858732
C  -3.7309 0.599211 -0.445346
C  -3.548292 -0.854646 0.051788
C  -1.542898 0.439794 0.431155
C  -4.493832 0.768355 -1.754558
C  -4.669522 -1.397243 0.936652
C  -0.176119 0.083936 -0.063249
C  0.96053 0.48148 0.573827
C  2.353164 0.169774 0.199686
C  2.694561 -0.622152 -0.934613
C  3.410646 0.680162 1.004484
C  4.041605 -0.890432 -1.247285
C  4.760458 0.411888 0.692747
C  5.082761 -0.375692 -0.436052
H  -4.1840 1.2087 0.368078
H  -3.371914 -1.52027 -0.819356
H  -1.509267 1.11622 1.311297
H  -4.500947 1.826995 -2.064476
H  -4.020102 0.175901 -2.556838
H  -5.541225 0.435657 -1.636861
H  -5.608766 -1.489524 0.360002
H  -4.404986 -2.395879 1.323507
H  -4.842369 -0.728946 1.798533
H  -0.161218 -0.543031 -0.962661
H  0.845912 1.107011 1.473097
H  1.90317 -1.028926 -1.573749
H  3.165723 1.291927 1.881962
H  4.285125 -1.501482 -2.123849
H  5.557914 0.815019 1.32689
H  6.129305 -0.586711 -0.682246
