program: Gaussian 09
title: 000110843
version: EM64L-G09RevD.01
frameworkgroup: C1[X(C16H13ClN4O)]
method: RPBEPBE
basis: SDD
operation: Freq
keyword: #p
keyword: freq=noraman
keyword: PBEPBE/SDD
title: #p freq=noraman PBEPBE/SDD
converged: YES YES NO NO
title: Mulliken charges:
elementType: Cl O N N N N C C C C C C C C C C C C C C C C H H H H H H H H H H H H H
charge: -0.015493 -0.203244 -0.276426 -0.031512 -0.058944 -0.050362 -0.440804 0.238868 0.172952 0.425492 -0.763369 -0.350027 -0.387611 -0.220598 -0.202557 -0.248622 0.261886 -0.265790 -0.264190 -0.212477 -0.211602 -0.217600 0.294831 0.241116 0.251556 0.253681 0.297324 0.279659 0.227681 0.226976 0.229095 0.279382 0.261661 0.239016 0.240054
chargesum: 0.00000
title: Mulliken charges with hydrogens summed into heavy atoms:
elementType: Cl O N N N N C C C C C C C C C C C C C C C C
charge: -0.015493 -0.203244 -0.276426 -0.031512 -0.058944 -0.050362 -0.145974 0.238868 0.172952 0.425492 -0.017016 -0.052703 -0.107953 0.007084 0.024420 -0.019527 0.261886 -0.265790 0.015191 0.049183 0.027414 0.022454
polarizability: 3.96151012e+02 6.98626532e-02 1.89083234e+02 5.81042126e+00 2.27223221e+00 1.48122669e+02
1716.lowfreq: -5.4018 -0.0024 -0.0023 -0.0014 1.9970 3.1655 12.3020 20.9851 29.9729
frequency: 12.2609 20.9630 29.9705 50.4554 79.4977 93.9060 97.1870 131.3907 138.8526 147.9898 166.5289 223.9011 240.0116 262.1108 282.7425 292.2199 318.1636 339.8514 371.2147 385.5348 408.7251 410.3320 459.4067 484.9807 513.0057 531.2015 543.2246 572.8257 599.5075 614.1450 640.1810 652.7834 687.4659 700.5956 714.8859 729.1078 769.7011 771.6388 787.8755 820.7015 855.9518 875.3396 910.3093 932.5297 938.7998 962.8149 982.9400 985.8027 987.9970 992.7577 998.8682 1007.7363 1022.6620 1029.8540 1035.5044 1040.3475 1045.0854 1096.8236 1120.9743 1126.6132 1168.0599 1172.8051 1184.9649 1188.1150 1191.2319 1245.9975 1256.6495 1291.8061 1324.9170 1355.7036 1379.2636 1383.5181 1386.4655 1400.0296 1424.9800 1447.6404 1448.7500 1451.9551 1454.2115 1485.9159 1568.0698 1581.2195 1593.4953 1596.3188 1611.3277 1642.9746 2978.3456 2982.3638 3057.7378 3113.3276 3130.5479 3141.7274 3142.4944 3155.3971 3162.1858 3168.5300 3178.9457 3188.2624 3190.8536
redmass: 7.4857 6.2105 5.1272 4.7781 7.0339 5.5248 3.5958 1.1835 5.0836 4.8743 6.9630 4.4307 5.7313 6.0845 6.9914 7.2980 6.1670 4.9295 6.0738 7.8800 4.9621 3.5818 3.4901 6.5041 3.4262 3.8882 6.9644 4.7767 6.0159 6.4489 5.9257 6.7716 7.4075 2.0916 7.3866 3.3170 1.6367 1.3922 6.4918 5.7080 1.2425 1.4016 3.4903 1.4165 4.1652 1.3956 2.2782 5.6246 1.3569 1.3504 1.3051 4.2212 5.4676 2.1246 2.3516 3.0096 2.3049 1.6567 1.6781 3.7946 1.1575 1.0519 1.4994 1.8605 1.1878 1.4649 1.7107 3.4107 1.3551 3.3165 8.4668 9.2945 9.8010 1.4391 2.3742 2.3259 2.3552 1.0530 1.1198 2.4582 6.3801 6.1410 6.8693 6.7910 6.0052 12.1869 1.0754 1.0433 1.0967 1.0989 1.0854 1.0860 1.0909 1.0902 1.0975 1.0954 1.0999 1.0939 1.0962
irintensity: 0.3173 0.6082 1.1291 1.6833 3.6877 0.5769 0.6976 0.2353 0.2373 3.1889 0.7781 1.1760 3.0587 4.4912 0.7342 2.1812 2.6412 4.0321 1.6170 1.8298 1.6825 0.4833 9.7334 10.6272 15.0681 4.3418 27.7406 17.7453 3.4492 0.1560 13.4339 6.9271 37.2317 40.2340 7.3101 10.9830 80.0652 69.8025 18.6045 1.4316 0.1771 1.3759 18.2387 11.4420 10.0968 5.6704 29.8276 5.3218 0.0067 0.7326 2.2275 14.0826 44.4677 10.5047 25.1928 16.6532 16.5466 31.2401 24.5315 58.9967 14.8807 0.0150 28.0408 6.2329 4.0848 2.6825 9.1786 215.4423 3.3651 38.3697 1.4855 1.6391 10.0314 28.4031 15.2754 7.4021 41.4053 19.3111 20.4342 166.4433 16.4489 9.5437 24.6344 9.8180 65.5057 179.2124 16.1288 10.2984 9.0069 9.9501 0.4197 1.6320 22.5200 5.5378 37.0355 5.9659 18.5861 1.1585 8.0230
temp: 298.150 k
press: 1.00000 atm
elementType: 17 8 7 7 7 7 6 6 6 6 6 6 6 6 6 6 6 6 6 6 6 6 1 1 1 1 1 1 1 1 1 1 1 1 1
symmnumber: 1
zpe: 675135.6 jmol-1
zpe.correction: 0.257146 hartree
zpe.thermalcorrener: 0.276402 hartree
zpe.thermalcorrenthalpy: 0.277346 hartree
zpe.thermalcorrgfe: 0.206161 hartree
zpe.sumelectzpe: -1370.187690 hartree
zpe.sumelectthermal: -1370.168434 hartree
zpe.sumelectthermalent: -1370.167490 hartree
zpe.sumelectthermalfe: -1370.238675 hartree
dipole: 1.7206 0.6005 -2.9648
dipole: 3.4801
quadrupole: -111.8867 -124.1324 -136.4497
quadrupole: -7.5243 -6.3815 2.0768
quadrupole: 12.2696 0.0239 -12.2935 -7.5243 -6.3815 2.0768
hfenergy: -1370.4448359 hartree
pointgroup: C01 [X(C16H13Cl1N4O1)]
dipole: 0.7658472 0.8793214 -0.7175578 debye
polarizability: 392.6872963|-8.7693817|172.2749529|27.9025459|19.4503574|168.394666 unknown
InChI: InChI=1S/C16H13ClN4O/c1-11-15(19-18-14-10-6-5-9-13(14)17)16(22)21(20-11)12-7-3-2-4-8-12/h2-10,15H,1H3
charge 0 multiplicity 1
35 atoms
Cl 4.822359 0.051696 2.574644
O  -0.943917 -1.649581 0.618536
N  -2.120674 0.396856 0.206242
N  -1.843828 1.805907 0.295093
N  1.291806 0.44476 0.144502
N  2.321383 0.092649 0.857494
C  0.08563 0.621659 0.992984
C  -0.605094 1.950914 0.721511
C  -1.021227 -0.397529 0.588764
C  -3.417716 -0.010756 -0.237969
C  0.032655 3.291956 0.895452
C  -3.737203 -1.388536 -0.367999
C  -4.384046 0.98115 -0.548797
C  -5.02551 -1.75763 -0.810221
C  -5.664694 0.589973 -0.98923
C  -5.995669 -0.778605 -1.12334
C  3.507643 -0.168969 0.093094
C  4.743814 -0.25717 0.787652
C  3.501453 -0.406002 -1.311965
C  5.942874 -0.561598 0.114422
C  4.691575 -0.716372 -1.991317
C  5.914497 -0.793834 -1.27872
H  0.336873 0.486366 2.065648
H  0.379995 3.435987 1.935764
H  -0.678452 4.09369 0.641031
H  0.922617 3.379888 0.244096
H  -2.991144 -2.148123 -0.126282
H  -4.120109 2.035567 -0.44422
H  -5.267683 -2.821586 -0.908851
H  -6.406263 1.360248 -1.228465
H  -6.99262 -1.076096 -1.465591
H  2.539696 -0.351397 -1.831861
H  6.880787 -0.617536 0.674061
H  4.673234 -0.906827 -3.069261
H  6.84446 -1.040521 -1.801602
