program: Gaussian 09
title: 000110812
version: EM64L-G09RevD.01
frameworkgroup: C1[X(C18H27N3O2)]
method: RPBEPBE
basis: SDD
operation: Freq
keyword: #p
keyword: freq=noraman
keyword: PBEPBE/SDD
title: #p freq=noraman PBEPBE/SDD
converged: YES YES NO NO
title: Mulliken charges:
elementType: O O N N N C C C C C C C C C C C C C C C C C C H H H H H H H H H H H H H H H H H H H H H H H H H H H
charge: -0.163616 -0.228359 -0.418600 -0.091840 -0.470179 -0.191537 -0.463672 -0.573342 0.246009 0.281918 -0.096303 -0.422529 -0.409703 -0.430729 0.156369 -0.394423 -0.314333 0.298175 -0.231045 -0.224427 -0.709735 -0.698687 -0.720496 0.275439 0.232936 0.249085 0.236013 0.229950 0.157274 0.305190 0.251755 0.242562 0.252307 0.208206 0.229842 0.234417 0.164623 0.242074 0.228608 0.227932 0.297356 0.193706 0.220572 0.260480 0.218743 0.221946 0.220673 0.242019 0.213413 0.213959
chargesum: 0.00000
title: Mulliken charges with hydrogens summed into heavy atoms:
elementType: O O N N N C C C C C C C C C C C C C C C C C C
charge: -0.163616 -0.228359 -0.113410 -0.091840 -0.172823 0.083902 0.018349 -0.107378 0.246009 0.281918 0.060972 -0.170775 -0.167141 0.029784 0.156369 0.069836 0.092364 0.298175 -0.002436 0.003506 -0.034976 -0.037325 -0.051106
polarizability: 2.63910075e+02 2.18811930e+01 1.96835854e+02 1.11423765e+01 -3.22513997e+00 2.08316221e+02
1716.lowfreq: -12.1375 -3.2143 -0.0007 -0.0005 -0.0004 4.5873 13.5009 17.0622 28.1320
frequency: 12.0566 16.3462 27.9430 37.6282 45.1590 49.2094 56.2017 77.8747 90.9298 110.7985 123.9178 129.9331 151.6726 176.4879 184.3631 203.0718 211.1424 214.2411 234.3526 245.9005 268.9436 279.0212 293.6397 321.4899 344.0683 371.5336 389.5018 417.9086 427.5860 452.3191 464.3611 488.0149 517.8948 542.1461 549.9013 583.8706 589.0917 647.2123 658.6352 673.3146 708.1701 721.4064 732.0905 762.8714 769.8637 771.5510 781.5644 811.8890 830.9310 835.4029 857.2196 876.5664 892.6306 900.5707 909.4266 935.5897 950.2006 975.6213 985.9977 991.1735 995.0578 1020.8099 1039.8163 1042.7374 1049.6848 1061.9841 1066.9999 1079.6859 1085.1647 1100.1554 1108.8334 1123.0319 1137.2970 1151.5009 1159.8276 1169.9144 1180.7583 1193.6643 1201.0076 1207.6283 1210.7341 1254.2601 1254.3987 1276.8628 1280.5981 1292.2688 1296.2755 1308.6724 1320.9901 1325.4921 1338.9911 1340.8029 1356.2754 1376.0912 1381.7181 1386.0034 1388.2191 1394.2482 1418.6599 1447.7643 1450.4850 1456.6576 1460.1827 1466.4608 1468.1989 1469.9987 1476.1192 1477.2800 1478.6024 1481.7169 1486.9421 1490.2405 1501.0649 1595.6878 1616.7418 1637.4588 1676.8262 2752.2796 2825.8340 2975.9237 2976.9250 2979.8199 2986.2782 2998.8885 3016.6534 3017.9308 3020.6776 3045.1997 3050.6463 3053.1934 3055.7226 3073.2220 3074.8126 3077.7396 3082.8578 3088.0633 3092.6447 3097.2429 3121.4961 3128.9310 3142.0328 3160.8924 3506.2938 3536.2707
redmass: 3.8756 4.1245 4.1632 4.1700 4.0223 5.9675 2.5682 2.2960 3.9710 3.0245 3.1374 3.6610 2.7613 2.4969 1.7982 3.5923 4.2741 1.2679 1.4696 2.7755 1.8970 2.1983 4.3694 2.9987 3.2499 2.5087 3.2693 2.8905 2.8584 3.2722 2.9001 1.3938 2.9813 3.5118 3.5531 3.3031 1.3319 4.0493 4.2672 3.1381 5.3274 3.2642 3.3769 1.2799 1.3593 2.4839 1.9450 1.3072 2.2417 2.2499 3.3202 1.4125 2.3238 2.0898 2.2518 2.9198 1.4770 3.0595 2.4978 1.3418 2.5209 2.2279 2.6825 2.5115 1.9492 2.2002 2.5039 2.0103 2.1644 1.8202 1.9280 2.0334 2.2050 1.2572 1.6455 1.0776 1.7318 2.2268 2.1810 3.0209 1.7289 1.3050 1.2974 2.2100 1.1930 1.5232 1.1430 1.2675 1.5050 1.3836 1.2452 1.2307 1.3913 1.2508 1.2350 1.3106 6.9589 1.2075 1.9930 2.2989 1.7724 1.2145 1.0772 1.0508 1.0549 1.1330 2.0684 1.0480 1.0444 1.0501 1.0751 1.0491 1.0713 6.8822 7.0948 5.4231 9.9015 1.0786 1.0717 1.0353 1.0370 1.0655 1.0356 1.0595 1.0826 1.0667 1.0646 1.0894 1.0902 1.1000 1.0992 1.0987 1.0995 1.0994 1.1008 1.1012 1.1006 1.1018 1.0854 1.0895 1.0948 1.1003 1.0764 1.0779
irintensity: 0.0919 0.4876 0.5256 3.6986 1.6597 1.0552 1.5977 0.0624 4.4918 0.4225 1.1636 0.5139 1.6880 0.7489 4.4247 3.8306 6.1115 2.8969 0.4428 3.8876 0.7525 2.2122 2.2552 1.6069 0.5076 0.1890 0.2947 2.8453 5.6872 24.8489 1.3837 58.4277 10.5086 8.0055 15.6377 13.9339 84.7825 8.8680 5.1675 1.3777 21.7261 1.7852 4.2058 75.8215 23.6487 6.4251 13.2299 2.3466 15.9815 0.8249 6.3428 0.5226 5.0386 7.6457 9.9825 5.7223 6.0251 7.9962 4.8927 0.2420 10.8893 6.0721 12.5341 5.8038 1.6401 23.7843 15.2788 17.7777 3.3680 14.9339 21.3539 42.8966 270.6583 2.5550 4.8949 1.0392 0.9779 12.9785 134.0058 61.7039 1.5843 3.0479 5.2287 3.1942 23.8183 7.2405 1.2399 1.4247 4.8302 10.9913 23.3786 9.8321 47.2326 21.3500 22.2927 16.8244 1.4484 6.0931 616.5465 71.2741 399.0046 8.0594 5.0681 12.6008 7.1833 20.9145 12.5751 11.5098 3.6411 2.7395 19.0815 11.6608 7.5687 1.2676 1.8361 54.9066 287.2092 119.7394 112.8851 20.7808 33.5927 28.4199 28.1420 24.3273 39.7888 14.1606 27.6519 9.3037 26.6163 1.0099 4.8140 38.8571 62.6266 68.3101 35.8359 46.7291 30.1172 29.3981 2.5940 3.6399 30.8717 30.7438 11.3892 20.8099
temp: 298.150 k
press: 1.00000 atm
elementType: 8 8 7 7 7 6 6 6 6 6 6 6 6 6 6 6 6 6 6 6 6 6 6 1 1 1 1 1 1 1 1 1 1 1 1 1 1 1 1 1 1 1 1 1 1 1 1 1 1 1
symmnumber: 1
zpe: 1113331.2 jmol-1
zpe.correction: 0.424045 hartree
zpe.thermalcorrener: 0.448574 hartree
zpe.thermalcorrenthalpy: 0.449519 hartree
zpe.thermalcorrgfe: 0.366116 hartree
zpe.sumelectzpe: -1015.067445 hartree
zpe.sumelectthermal: -1015.042916 hartree
zpe.sumelectthermalent: -1015.041972 hartree
zpe.sumelectthermalfe: -1015.125375 hartree
dipole: 1.8485 4.6849 4.8542
dipole: 6.9949
quadrupole: -125.1886 -142.8115 -141.0501
quadrupole: 0.6117 -10.6574 -10.3805
quadrupole: 11.1614 -6.4614 -4.7001 0.6117 -10.6574 -10.3805
hfenergy: -1015.4914908 hartree
pointgroup: C01 [X(C18H27N3O2)]
dipole: 0.8139306 0.1408938 2.6251087 debye
polarizability: 265.1125549|9.7410845|205.2637525|20.6894315|-6.1395802|198.6858418 unknown
InChI: InChI=1S/C18H27N3O2/c1-4-16(21(5-2)6-3)17(22)20-18(23)19-15-12-11-13-9-7-8-10-14(13)15/h7-10,15-16,19-20H,4-6,11-12H2,1-3H3
charge 0 multiplicity 1
50 atoms
O  -2.563673 0.241526 -1.945771
O  0.234089 -0.777545 -2.358845
N  1.353779 -0.118205 -0.418968
N  -4.231655 0.626902 0.524622
N  -0.973391 -0.40072 -0.337426
C  2.700254 -0.218155 -1.032995
C  3.118297 1.048749 -1.853763
C  3.939894 1.942009 -0.873771
C  3.764546 -0.286615 0.058179
C  4.462427 0.945024 0.154345
C  -3.37563 -0.551604 0.254625
C  4.064989 -1.360738 0.920786
C  5.479531 1.108199 1.118342
C  -4.161463 -1.764531 -0.317806
C  -2.290224 -0.17878 -0.798468
C  -5.480745 0.358371 1.279031
C  -3.442903 1.787942 1.013824
C  0.21512 -0.438706 -1.148267
C  5.088447 -1.19769 1.88572
C  5.790104 0.029568 1.982248
C  -3.254097 -2.962916 -0.674829
C  -5.311679 -0.133336 2.74443
C  -4.247234 3.098328 1.092049
H  2.671808 -1.110112 -1.682574
H  3.766782 0.723183 -2.687462
H  2.241332 1.553166 -2.290476
H  4.751494 2.488738 -1.386495
H  3.300594 2.705881 -0.387167
H  -2.843949 -0.899698 1.187382
H  1.275019 0.340789 0.491013
H  3.523366 -2.310354 0.840175
H  6.028755 2.053647 1.197592
H  -4.69999 -1.413711 -1.217526
H  -4.913907 -2.096812 0.421058
H  -6.073905 1.289649 1.276833
H  -6.079427 -0.373639 0.710188
H  -2.96668 1.583699 2.009853
H  -2.616574 1.942935 0.295352
H  5.345603 -2.02482 2.5568
H  6.583981 0.141535 2.729656
H  -0.874999 -0.642742 0.652665
H  -2.669111 -3.304486 0.201155
H  -3.866469 -3.815348 -1.019373
H  -2.546242 -2.712172 -1.484296
H  -4.778916 -1.101225 2.793806
H  -4.750239 0.597176 3.35553
H  -6.30326 -0.273112 3.213538
H  -4.761397 3.283897 0.132666
H  -5.000491 3.089839 1.899876
H  -3.562762 3.943821 1.288135
