program: Gaussian 09
title: 000110807
version: EM64L-G09RevD.01
frameworkgroup: C1[X(C3H6O2S2)]
method: RPBEPBE
basis: SDD
operation: Freq
keyword: #pfreq=noraman
keyword: PBEPBE/SDD
title: #p freq=noraman PBEPBE/SDD
converged: YES YES NO NO
title: Mulliken charges:
elementType: S S O O C C C H H H H H H
charge: -0.020957 -0.015620 -0.407762 -0.220894 -0.520640 -0.651582 0.278124 0.308726 0.288705 0.295125 0.158030 0.116694 0.392050
chargesum: 0.00000
title: Mulliken charges with hydrogens summed into heavy atoms:
elementType: S S O O C C C
charge: 0.137073 0.101074 -0.015712 -0.220894 -0.211914 -0.067751 0.278124
polarizability: 6.08067780e+01 -8.52145447e-01 7.68497532e+01 3.94710806e-01 -4.95291605e+00 6.54837004e+01
1716.lowfreq: -12.8941 -7.7023 -0.0021 -0.0020 -0.0014 12.2465 56.6991 84.2705 146.4028
frequency: 56.5833 84.2460 146.3951 212.8710 238.7480 287.0679 318.5667 379.3381 413.6678 543.5082 596.8915 612.9479 658.2970 734.2867 768.1924 829.8715 884.2143 986.8381 1029.7484 1058.3664 1172.2358 1196.7260 1245.1740 1288.9971 1336.4166 1429.5574 1656.1310 2387.2033 2388.1178 3032.0157 3047.2871 3120.5776 3523.7741
redmass: 8.2314 8.1934 7.5310 1.8426 2.2500 1.9337 1.1398 8.0572 4.4151 4.1422 1.5024 4.4474 2.9883 1.6107 2.5484 1.4945 1.9112 1.7928 3.1289 2.1688 1.0588 1.2233 1.3312 1.3854 1.8444 1.0894 9.5372 1.0371 1.0371 1.0770 1.0635 1.1076 1.0643
irintensity: 0.0951 2.6639 5.7674 28.8149 20.3109 16.7488 12.4546 8.8108 3.9121 22.3261 104.9660 24.0531 54.4065 49.5947 5.7545 16.1605 10.3376 74.7907 0.6279 201.3118 1.3642 1.7296 1.6953 4.8763 40.0040 15.7094 167.1081 15.2749 5.6178 5.9874 16.2305 2.8909 37.5889
temp: 298.150 k
press: 1.00000 atm
elementType: 16 16 8 8 6 6 6 1 1 1 1 1 1
symmnumber: 1
zpe: 225285.9 jmol-1
zpe.correction: 0.085807 hartree
zpe.thermalcorrener: 0.094515 hartree
zpe.thermalcorrenthalpy: 0.095459 hartree
zpe.thermalcorrgfe: 0.051492 hartree
zpe.sumelectzpe: -1063.913266 hartree
zpe.sumelectthermal: -1063.904558 hartree
zpe.sumelectthermalent: -1063.903614 hartree
zpe.sumelectthermalfe: -1063.947581 hartree
dipole: 1.1342 -1.0106 1.4756
dipole: 2.1178
quadrupole: -58.8650 -56.5654 -56.0444
quadrupole: -6.2887 0.6317 -1.8481
quadrupole: -1.7068 0.5929 1.1139 -6.2887 0.6317 -1.8481
hfenergy: -1063.9990728 hartree
pointgroup: C01 [X(C3H6O2S2)]
dipole: -0.5542029 0.1488459 0.604105 debye
dipolederiv: -0.1137041 -0.1107579 0.118528 -0.1317875 -0.2808553 -0.0504428 0.0645024 0.0088535 -0.0827083 -0.2348557 -0.1553725 -0.0014619 -0.1865269 -0.0832597 0.0157039 -0.0201474 0.0265958 -0.1716447 -0.7522792 0.3845693 0.3478183 0.3589138 -0.7738082 -0.2419852 0.2499942 -0.1754954 -0.4200999 -0.636999 -0.0211725 -0.2140867 0.1583168 -0.5217376 -0.1451939 -0.0671945 -0.341178 -0.6787383 -0.1647134 0.0111844 -0.1578174 -0.0655309 0.2810801 0.0574108 -0.2603743 0.2896497 -0.0489054 0.0942815 0.1876876 -0.0832345 0.1017198 0.0272457 -0.0190957 -0.0516878 -0.1904794 0.2471471 1.1392999 -0.3630172 0.038625 -0.4259724 0.7513741 0.4093004 0.1584524 0.3975038 0.8606042 0.0185996 -0.0167248 0.0918478 -0.0182552 0.0002232 0.0250166 0.0640421 -0.0047709 -0.0103553 -0.02602 -0.0219358 -0.0698091 0.0063385 0.0452503 0.0937441 -0.0442071 0.0782246 -0.0558154 0.0867703 0.0224353 0.0728219 0.0333184 -0.0233344 -0.0413124 0.0577067 -0.0254029 0.0458702 0.1928736 -0.0242878 -0.0651338 0.0057829 0.1477586 0.0163088 -0.0206336 -0.0559522 0.0440493 0.1253696 0.08613 0.0326965 0.164776 0.0763071 -0.0852794 0.0225862 0.0088287 0.0490008 0.2713768 0.0212618 -0.1107941 -0.0010932 0.3537561 -0.0341752 -0.1530392 -0.0163773 0.2215956 unknown
polarizability: 64.7236987|-6.8995873|72.7547142|-2.5749892|4.4688193|65.6618186 unknown
InChI: InChI=1S/C3H6O2S2/c4-3(5)2(7)1-6/h2,4,6-7H,1H2
charge 0 multiplicity 1
13 atoms
S  1.349526 -1.714945 -0.04617
S  1.809287 1.76515 -0.703278
O  -1.636231 1.012319 0.532697
O  -1.223839 -0.484064 -1.191883
C  0.370675 -0.28045 0.715935
C  1.254357 0.97186 0.916361
C  -0.878387 0.035328 -0.110139
H  0.030921 -0.629138 1.708286
H  2.143111 0.709708 1.511763
H  0.680614 1.753765 1.439564
H  0.583358 -1.763301 -1.205402
H  2.407887 0.603135 -1.178126
H  -2.433178 1.237132 -0.019606
