program: Gaussian 09
title: 000110799
version: EM64L-G09RevD.01
frameworkgroup: C1[X(C4H8O4S)]
method: RPBEPBE
basis: SDD
operation: Freq
keyword: #pfreq=noraman
keyword: PBEPBE/SDD
title: #p freq=noraman PBEPBE/SDD
converged: YES YES NO NO
title: Mulliken charges:
elementType: S O O O O C C C C H H H H H H H H
charge: 1.053131 -0.294896 -0.413986 -0.498882 -0.517832 -0.007624 -0.339792 -0.308223 -0.726993 0.247638 0.227940 0.226695 0.230915 0.257166 0.284639 0.293168 0.286935
chargesum: 0.00000
title: Mulliken charges with hydrogens summed into heavy atoms:
elementType: S O O O O C C C C
charge: 1.053131 -0.294896 -0.413986 -0.498882 -0.517832 0.240013 0.114843 0.179859 0.137750
polarizability: 1.16114963e+02 3.79446503e-01 7.28620040e+01 6.16732324e-01 1.18626501e+00 7.18054204e+01
1716.lowfreq: -3.8965 0.0014 0.0018 0.0030 5.6825 9.9877 26.3665 34.7082 60.5240
frequency: 25.7747 34.5643 60.5183 132.8710 151.4039 179.3527 203.5629 226.1497 282.5487 333.9104 352.3756 395.2795 417.4424 527.6342 599.6251 742.2624 792.1862 836.6871 883.9467 910.8625 914.5191 972.0957 996.1212 1023.7913 1039.7410 1090.9333 1110.5760 1134.7984 1211.1525 1236.8186 1316.3443 1348.6222 1398.0454 1415.4067 1417.7353 1464.8101 1481.2214 2987.6293 3041.4733 3067.9781 3072.0451 3118.8611 3182.2155 3190.0070 3199.2463
redmass: 8.1404 2.9371 4.2723 3.8952 1.0713 5.7035 4.3141 4.4397 6.8952 9.1486 5.2497 5.2565 2.7187 8.7519 9.0849 8.1117 4.2146 11.4780 1.3141 4.3720 2.8737 1.9225 1.3204 1.3888 2.0075 1.4299 1.3188 1.5783 1.2809 1.4507 1.1329 1.2514 1.9019 1.0529 1.0507 1.1192 1.1741 1.0586 1.0248 1.1047 1.0532 1.0924 1.1192 1.1078 1.1078
irintensity: 0.1893 0.1734 2.6918 10.8528 0.4823 5.5347 2.3266 7.1493 12.8386 29.0261 22.8524 48.2826 4.0072 31.3876 50.3367 7.9542 42.9552 69.5124 14.5017 73.4953 44.6013 17.6331 35.3048 2.8519 66.2079 5.8540 16.8365 1.1182 12.4096 1.8507 3.1522 8.7439 2.5518 13.4287 12.2712 13.1865 2.8803 23.1683 0.1581 8.7180 24.3540 16.1135 28.6922 0.0818 0.0064
temp: 298.150 k
press: 1.00000 atm
elementType: 16 8 8 8 8 6 6 6 6 1 1 1 1 1 1 1 1
symmnumber: 1
zpe: 320127.5 jmol-1
zpe.correction: 0.121930 hartree
zpe.thermalcorrener: 0.133170 hartree
zpe.thermalcorrenthalpy: 0.134114 hartree
zpe.thermalcorrgfe: 0.082925 hartree
zpe.sumelectzpe: -855.211070 hartree
zpe.sumelectthermal: -855.199830 hartree
zpe.sumelectthermalent: -855.198886 hartree
zpe.sumelectthermalfe: -855.250075 hartree
dipole: -0.4911 5.0500 -0.9575
dipole: 5.1634
quadrupole: -64.5321 -59.9529 -64.2258
quadrupole: -3.3388 5.5848 -2.6786
quadrupole: -1.6285 2.9507 -1.3222 -3.3388 5.5848 -2.6786
hfenergy: -855.3329999 hartree
pointgroup: C01 [X(C4H8O4S1)]
dipole: -0.2037828 1.8843366 -0.7310981 debye
dipolederiv: 1.8336656 -0.0097117 -0.0166871 0.1850902 1.2892632 -0.0319727 0.0111736 -0.0051181 1.2965964 -0.6837026 0.1517659 0.0593543 0.1988745 -0.4926353 0.0210572 0.1402888 0.0258597 -0.3299414 -1.1033992 0.0346812 -0.0860923 0.0830115 -0.4850804 0.0391447 -0.0290545 -0.0164205 -0.4077214 -0.6669278 0.0086047 0.0840826 -0.0011246 -0.5065644 0.0073351 0.1892431 0.0559227 -0.6362611 -0.5999692 0.0102324 -0.0142807 -0.0744916 -0.58793 -0.0330717 -0.1104475 -0.1039232 -0.5629404 0.3669446 0.0345405 -0.0432087 0.0623366 0.1692075 -0.0435959 -0.2922901 0.013931 0.3059331 0.1286934 -0.0534255 -0.0884769 0.1350475 0.2460974 0.0099386 -0.030497 -0.0374205 0.2577133 0.5628348 -0.0597926 0.0944093 -0.5779663 0.2392306 -0.0308213 0.1391827 0.0081869 0.2148821 -0.1340296 -0.0006307 0.021009 0.0040058 -0.133207 0.0218429 -0.0153413 0.0159135 -0.1092955 0.003182 -0.0161627 -0.0365521 -0.0331548 0.0938857 0.0222435 -0.0016162 0.035522 -0.1051456 0.0283788 -0.0827956 0.0704943 -0.1184772 -0.0416335 0.0384895 0.0660127 0.0664967 0.0171771 0.1332181 -0.0034353 0.0420843 -0.0358356 0.0195075 -0.0355573 0.0161505 -0.0737725 -0.0984567 -0.0598337 0.0496557 -0.0542204 0.0601081 0.0672394 0.0071735 -0.0488892 0.0471288 -0.0931972 0.0218589 -0.0859133 -0.0253241 0.0541397 -0.016295 -0.0211136 -0.0074291 -0.0633863 0.0725443 -0.0104058 -0.0123881 -0.009301 0.028064 0.0646124 0.0248458 -0.026422 0.0267511 0.1139175 0.1031758 0.0027836 -0.0357528 -0.0055144 0.0192858 -0.0279263 -0.0482814 -0.011839 0.0481584 0.0763158 0.0319916 0.0384624 0.0358863 0.0550162 0.0319882 0.0482168 0.0161677 0.016037 unknown
polarizability: 116.0131613|-0.2608529|73.2584445|-2.2335517|0.9162497|71.5107818 unknown
InChI: InChI=1S/C4H8O4S/c1-9(5,6)8-3-4-2-7-4/h4H,2-3H2,1H3
charge 0 multiplicity 1
17 atoms
S  -1.979234 -0.115694 0.149158
O  3.297585 -0.692663 -0.277901
O  -0.210265 0.536879 0.174868
O  -2.550058 -0.301672 1.64897
O  -2.033015 -1.353626 -0.897623
C  1.973517 -0.048672 -0.614971
C  3.066159 0.778637 -0.012773
C  0.814952 -0.534964 0.234285
C  -2.683247 1.466153 -0.623275
H  1.773039 0.037116 -1.689968
H  3.642443 1.457112 -0.652163
H  3.007738 1.048942 1.048901
H  1.132196 -0.689268 1.280655
H  0.403093 -1.477793 -0.178027
H  -3.769799 1.315899 -0.683717
H  -2.405284 2.280419 0.058367
H  -2.20842 1.560196 -1.607687
