program: Gaussian 09
title: 000110796
version: EM64L-G09RevD.01
frameworkgroup: C1[X(C16H18)]
method: RPBEPBE
basis: SDD
operation: Freq
keyword: #p
keyword: freq=noraman
keyword: PBEPBE/SDD
title: #p freq=noraman PBEPBE/SDD
converged: YES YES NO NO
title: Mulliken charges:
elementType: C C C C C C C C C C C C C C C C H H H H H H H H H H H H H H H H H H
charge: -0.334683 0.345337 0.475385 0.291418 -0.745171 -0.539873 0.445913 -0.418929 -0.378166 -0.440803 -0.443599 -0.847685 -0.821611 -0.229333 -0.229219 -0.247970 0.210238 0.218897 0.231439 0.224968 0.241856 0.226546 0.252680 0.230152 0.228785 0.220850 0.226655 0.254607 0.228501 0.222622 0.227610 0.222830 0.223514 0.226240
chargesum: 0.00000
title: Mulliken charges with hydrogens summed into heavy atoms:
elementType: C C C C C C C C C C C C C C C C
charge: -0.124445 0.345337 0.475385 0.291418 -0.069867 -0.298017 0.445913 -0.192383 -0.125486 -0.210651 -0.214814 -0.145574 -0.142879 -0.006502 -0.005705 -0.021730
polarizability: 2.13069096e+02 -1.48578953e+01 1.47845115e+02 -9.05138614e+00 4.84291806e+00 1.38413157e+02
1716.lowfreq: -9.9488 -8.6258 -0.0006 -0.0005 -0.0004 6.6619 22.5615 33.2984 38.2216
frequency: 22.3828 33.0845 38.1716 62.7712 120.8794 135.9313 166.5044 185.5029 212.7022 246.7795 274.2744 298.2615 313.5889 327.1424 364.5864 403.2890 442.3025 458.4453 475.6623 515.4102 552.6337 581.2574 617.6099 640.4277 704.2202 707.3511 737.3676 755.3918 771.1371 778.0120 823.0634 855.2245 902.1892 907.0373 921.5296 953.2805 975.7899 977.9756 989.8050 994.3366 997.9595 1007.2781 1026.0643 1043.6344 1048.7764 1050.9422 1061.1402 1086.5488 1130.8881 1165.1413 1170.8379 1187.1353 1192.6777 1218.5180 1249.7217 1258.8389 1290.7391 1313.4086 1332.2154 1367.1040 1381.9237 1389.0081 1396.0399 1399.4462 1411.7542 1439.2305 1468.8005 1470.3039 1470.9928 1472.0354 1478.5449 1482.1341 1487.8767 1497.6532 1584.8222 1591.4596 1610.6522 1624.6624 2968.5248 2969.2825 2972.8477 2980.7308 3044.8110 3049.9707 3079.1150 3080.5501 3080.9362 3081.8420 3108.3879 3111.1287 3121.5492 3129.3096 3133.7122 3137.2557 3144.2765 3160.8505
redmass: 1.1211 2.9677 3.6021 4.5718 2.3546 2.6018 1.2243 3.0678 3.6061 3.6074 2.5093 1.1862 2.8514 3.1397 3.2320 2.8282 3.0288 4.7174 2.9839 3.5000 3.0168 4.2000 6.0942 4.1354 3.1364 2.0954 3.8649 2.8578 2.0343 3.1291 1.2743 1.2483 2.5309 1.4537 1.4052 1.3497 1.5978 1.3956 5.0942 1.3455 2.0702 1.3533 2.1875 1.5824 1.5995 2.3204 1.5855 1.5980 2.4376 1.5635 1.0572 1.1368 2.0118 1.7615 2.7693 1.7946 1.4994 1.4211 1.3567 4.4726 6.4934 1.2040 1.2494 1.2650 2.9799 2.1700 1.0546 1.0474 1.0753 1.0624 1.9140 1.1093 1.4441 1.9735 5.6084 6.0442 6.0698 6.3372 1.0515 1.0687 1.0372 1.0352 1.0952 1.0975 1.0996 1.0987 1.1001 1.0986 1.0873 1.0870 1.0856 1.0903 1.0911 1.0963 1.0956 1.1014
irintensity: 0.3579 0.0385 0.0302 0.2169 0.9339 1.5933 0.4204 0.3181 1.8631 0.8108 0.3135 0.1141 0.1941 0.7299 0.4291 0.0657 5.2560 0.3383 0.9759 11.5565 11.2992 5.8246 0.2256 0.5845 12.8802 39.3947 3.4145 7.8978 31.8309 3.2644 32.7396 0.0675 2.9233 6.1078 2.6080 0.2775 5.0728 0.1552 0.1654 0.1221 9.0572 5.6375 10.9629 1.8945 9.7721 22.6953 4.0624 7.2463 2.2913 8.9101 0.2098 1.6040 0.6331 1.5498 1.7195 0.8278 4.5382 3.2611 1.4327 0.2312 1.2195 12.2227 15.3034 2.8444 4.3457 9.7539 5.0764 6.7731 7.0801 21.5427 10.2949 32.4435 29.4824 16.1075 4.3140 0.9754 12.9959 7.4932 48.3394 3.2134 39.0154 27.4758 16.1448 22.3487 29.4491 28.0090 32.4345 26.6471 10.5560 14.1194 0.2408 25.4436 15.5726 24.4030 37.7889 28.1003
temp: 298.150 k
press: 1.00000 atm
elementType: 6 6 6 6 6 6 6 6 6 6 6 6 6 6 6 6 1 1 1 1 1 1 1 1 1 1 1 1 1 1 1 1 1 1
symmnumber: 1
zpe: 756370.7 jmol-1
zpe.correction: 0.288086 hartree
zpe.thermalcorrener: 0.303503 hartree
zpe.thermalcorrenthalpy: 0.304448 hartree
zpe.thermalcorrgfe: 0.243967 hartree
zpe.sumelectzpe: -619.359809 hartree
zpe.sumelectthermal: -619.344392 hartree
zpe.sumelectthermalent: -619.343448 hartree
zpe.sumelectthermalfe: -619.403928 hartree
dipole: -0.0597 -0.1104 0.2664
dipole: 0.2944
quadrupole: -90.0818 -93.1628 -93.3556
quadrupole: -3.4282 -2.4667 1.8067
quadrupole: 2.1182 -0.9627 -1.1555 -3.4282 -2.4667 1.8067
hfenergy: -619.6478951 hartree
pointgroup: C01 [X(C16H18)]
dipole: 0.0240392 -0.0044174 0.1132321 debye
polarizability: 209.8515762|-22.1818308|153.1333486|1.7596892|0.1846954|136.3424435 unknown
InChI: InChI=1S/C16H18/c1-12-9-10-13(2)16(11-12)14(3)15-7-5-4-6-8-15/h4-11,14H,1-3H3
charge 0 multiplicity 1
34 atoms
C  0.358737 -0.460006 1.27888
C  -0.96012 -0.323904 0.503046
C  1.591027 -0.125171 0.416595
C  -1.320331 -1.317847 -0.463582
C  0.41428 0.371914 2.589208
C  -1.82823 0.773614 0.711045
C  -3.043561 0.933847 -0.00401
C  -2.532963 -1.159813 -1.174776
C  1.575258 0.947485 -0.51109
C  2.797014 -0.851697 0.589594
C  -3.385715 -0.053947 -0.95554
C  -0.442191 -2.528628 -0.732015
C  -3.941533 2.133408 0.250591
C  2.735677 1.286416 -1.242952
C  3.959944 -0.516455 -0.139942
C  3.933682 0.557353 -1.059889
H  0.459047 -1.524079 1.577204
H  0.422979 1.457445 2.382968
H  1.340899 0.138677 3.143257
H  -0.449192 0.145296 3.241019
H  -1.562094 1.530923 1.45736
H  -2.816716 -1.919372 -1.913837
H  0.646098 1.506549 -0.670262
H  2.823361 -1.688319 1.300272
H  -4.319089 0.037069 -1.524452
H  -0.318531 -3.155229 0.173267
H  -0.881807 -3.164896 -1.518971
H  0.572558 -2.234195 -1.057927
H  -3.436522 3.080895 -0.018326
H  -4.872279 2.072006 -0.339544
H  -4.22309 2.208173 1.317888
H  2.704627 2.116434 -1.958401
H  4.881319 -1.092212 0.005612
H  4.832656 0.818864 -1.62949
