program: Gaussian 09
title: 000110792
version: EM64L-G09RevD.01
frameworkgroup: C1[X(C10H13NO3)]
method: RPBEPBE
basis: SDD
operation: Freq
keyword: #p
keyword: freq=noraman
keyword: PBEPBE/SDD
title: #p freq=noraman PBEPBE/SDD
converged: YES YES NO NO
title: Mulliken charges:
elementType: O O O N C C C C C C C C C C H H H H H H H H H H H H H
charge: -0.268223 -0.295793 -0.420211 -0.030449 0.100762 -0.081341 0.232088 -0.397044 0.093844 -0.500792 0.071324 -0.207310 -0.754603 -0.677598 0.227734 0.232236 0.232627 0.256100 0.232656 0.190537 0.246284 0.237207 0.234522 0.212785 0.218922 0.236419 0.377319
chargesum: 0.00000
title: Mulliken charges with hydrogens summed into heavy atoms:
elementType: O O O N C C C C C C C C C C
charge: -0.268223 -0.295793 -0.042892 -0.030449 0.100762 0.146392 0.232088 0.067819 0.093844 -0.244692 0.071324 0.215883 -0.036591 -0.009473
polarizability: 1.50761675e+02 -4.11038043e-01 1.42872924e+02 7.34701552e+00 6.99614565e+00 7.84204270e+01
1716.lowfreq: -6.6654 -1.8075 -0.0008 -0.0006 0.0005 8.1545 41.6349 65.9304 80.0510
frequency: 41.5610 65.9278 80.0413 81.6596 102.5703 135.8087 151.2980 218.4904 231.5852 255.7478 265.5088 302.5899 320.0595 368.2140 444.9925 485.0296 538.5224 552.8317 568.5716 594.8697 611.6116 623.3205 741.5082 762.4725 790.1323 809.8383 845.3914 851.3332 878.2199 912.0664 933.1994 966.8995 991.1346 1006.9889 1040.5424 1044.3741 1063.7290 1113.7033 1130.1430 1136.6432 1179.4325 1235.3856 1247.7624 1262.1959 1271.0872 1286.0386 1312.6461 1322.2056 1348.9159 1377.6275 1392.3559 1398.5048 1427.9271 1455.9150 1461.0932 1461.6793 1470.5600 1476.9827 1479.3432 1490.9388 1584.3215 1613.9390 2943.3938 2950.5958 2987.5325 2993.5459 2995.5270 3039.9603 3050.8568 3063.4720 3090.6665 3101.7595 3122.8346 3139.0821 3400.5765
redmass: 3.1876 3.0085 2.0572 1.1405 4.6203 3.8534 2.6895 3.7475 1.5893 2.8211 3.0896 4.2511 3.3726 4.6506 5.5503 5.4392 5.1657 4.3936 3.9976 5.5632 3.0678 1.4938 4.6332 5.9683 5.2885 1.1192 3.4963 5.0309 1.3664 3.7866 5.0531 2.5957 2.4587 2.0025 3.3532 1.5449 3.9208 2.1442 1.0875 1.4323 2.6782 3.1588 1.1530 1.3584 1.6348 2.2556 1.9895 1.1351 2.6557 1.3910 1.2851 1.2985 3.7356 1.0765 1.2580 1.0524 1.5194 1.4155 1.0762 1.0890 7.4632 8.3426 1.0837 1.0644 1.0376 1.0364 1.0579 1.0987 1.1069 1.0965 1.0991 1.1011 1.0994 1.0922 1.0658
irintensity: 0.2292 0.5234 0.3540 0.9915 2.2722 3.3547 11.4236 4.7587 0.4802 2.8608 7.7116 3.7397 1.6160 1.4292 2.1346 3.4672 1.3091 1.2381 9.6877 4.5697 46.2640 71.6564 1.6757 7.7069 5.8120 6.3056 23.2897 19.5062 12.6710 142.3768 118.2834 42.1269 18.3171 15.7652 124.5869 4.8802 40.7851 9.0345 0.3518 6.6610 70.6264 2.8898 1.4000 26.6675 97.8764 45.6841 18.7388 27.5049 14.3670 3.3587 28.3972 23.9993 23.5829 17.3654 26.4888 19.9030 16.7402 0.8972 7.3670 4.9537 15.9216 12.8345 34.4548 75.8164 16.0534 24.8717 43.7560 15.5365 20.3693 16.3188 37.8728 34.3434 9.9602 16.2024 150.0616
temp: 298.150 k
press: 1.00000 atm
elementType: 8 8 8 7 6 6 6 6 6 6 6 6 6 6 1 1 1 1 1 1 1 1 1 1 1 1 1
symmnumber: 1
zpe: 565210.4 jmol-1
zpe.correction: 0.215277 hartree
zpe.thermalcorrener: 0.229118 hartree
zpe.thermalcorrenthalpy: 0.230062 hartree
zpe.thermalcorrgfe: 0.174080 hartree
zpe.sumelectzpe: -668.205833 hartree
zpe.sumelectthermal: -668.191993 hartree
zpe.sumelectthermalent: -668.191049 hartree
zpe.sumelectthermalfe: -668.247031 hartree
dipole: -3.2620 0.5373 -0.5216
dipole: 3.3468
quadrupole: -83.0790 -78.4238 -82.7908
quadrupole: 4.5722 0.0277 1.5965
quadrupole: -1.6478 3.0074 -1.3596 4.5722 0.0277 1.5965
hfenergy: -668.4211104 hartree
pointgroup: C01 [X(C10H13N1O3)]
dipole: 1.289579 0.13744 0.2278739 debye
polarizability: 150.629261|-0.3771851|143.5250087|7.7570359|-3.1581443|77.9007564 unknown
InChI: InChI=1S/C10H13NO3/c1-3-13-10-8-7(5-14-10)4-11-6(2)9(8)12/h4,10,12H,3,5H2,1-2H3
charge 0 multiplicity 1
27 atoms
O  1.633575 1.793968 0.549049
O  1.998351 -0.536635 -0.186803
O  -0.458546 -2.126527 0.372764
N  -2.854913 0.583825 -0.408855
C  -0.178965 0.303563 0.330147
C  1.273702 0.377503 0.703615
C  -0.678933 1.573616 -0.007409
C  0.457058 2.575393 0.05202
C  -0.979807 -0.841728 0.200233
C  -2.033666 1.680834 -0.373863
C  -2.354972 -0.66132 -0.141142
C  3.460282 -0.582632 0.081865
C  -3.28605 -1.844838 -0.239763
C  4.064558 -1.632985 -0.846287
H  1.52097 0.100278 1.751989
H  0.698924 2.997316 -0.941647
H  0.292373 3.401609 0.767154
H  -2.495219 2.634143 -0.651198
H  3.87912 0.422766 -0.108743
H  3.623628 -0.837737 1.151668
H  -4.285513 -1.497114 -0.541973
H  -2.912259 -2.580525 -0.975772
H  -3.359729 -2.378567 0.725795
H  5.157763 -1.690063 -0.694474
H  3.634784 -2.63122 -0.650895
H  3.872244 -1.372605 -1.90107
H  0.53464 -2.07492 0.265594
