program: Gaussian 09
title: 000110778
version: EM64L-G09RevD.01
frameworkgroup: C1[X(C6H16N2)]
method: RPBEPBE
basis: SDD
operation: Freq
keyword: #pfreq=noraman
keyword: PBEPBE/SDD
title: #p freq=noraman PBEPBE/SDD
converged: YES YES NO NO
title: Mulliken charges:
elementType: N N C C C C C C H H H H H H H H H H H H H H H H
charge: -0.095712 -0.558099 -0.070839 -0.369885 -0.401112 -0.716680 -0.610584 -0.628133 0.199817 0.186305 0.205063 0.196770 0.220091 0.195168 0.217960 0.213858 0.220350 0.188024 0.222410 0.188901 0.232968 0.220285 0.253063 0.290011
chargesum: 0.00000
title: Mulliken charges with hydrogens summed into heavy atoms:
elementType: N N C C C C C C
charge: -0.095712 -0.015024 0.128978 0.021482 0.015749 -0.089694 0.020200 0.014021
polarizability: 8.95795410e+01 2.45818790e+00 7.52459921e+01 8.92269788e-01 -9.02510259e-01 7.45903230e+01
1716.lowfreq: -11.7287 -0.0006 -0.0006 0.0002 1.3062 16.0306 56.0487 86.2846 139.7616
frequency: 55.7744 86.2673 139.7440 170.2270 220.2952 233.0048 242.2008 266.1567 298.0823 338.2773 350.7679 359.5434 414.3730 479.2927 542.2746 636.9581 784.2487 810.2027 839.3034 927.3899 940.6159 1005.1835 1028.7024 1033.7714 1052.6662 1085.5601 1100.8773 1132.0668 1150.1623 1185.6815 1204.7795 1254.9657 1264.1979 1305.4769 1314.3618 1342.2501 1360.1985 1370.2373 1387.0974 1417.6062 1440.2846 1449.3255 1459.9245 1461.5573 1473.6839 1475.4221 1477.5887 1482.4063 1487.1687 1626.0876 2825.5025 2846.5952 2862.2066 2961.2891 2963.5693 2984.2542 2998.7470 3015.4627 3027.2829 3052.1504 3055.0757 3069.7086 3074.1642 3084.7532 3458.1909 3591.3898
redmass: 2.9248 2.8564 2.0434 2.5577 1.0745 1.2509 1.1253 1.9746 1.9599 1.6273 1.9424 1.6549 1.9868 2.4961 1.4650 2.2071 2.8116 2.6511 1.6338 1.3803 1.7143 1.7540 1.9186 1.5639 1.7982 1.2945 1.9247 1.6305 2.3604 1.6612 2.0524 1.7243 2.1699 1.3375 1.3564 1.2654 1.2346 1.3997 1.2419 1.1425 1.1553 1.0853 1.0567 1.0700 1.0623 1.0517 1.0510 1.0600 1.0547 1.0901 1.0698 1.0570 1.0573 1.0765 1.0384 1.0680 1.0875 1.0724 1.0721 1.0985 1.0984 1.0995 1.1011 1.1003 1.0437 1.0983
irintensity: 0.7808 0.3535 0.6968 0.3207 0.2054 0.4307 0.6054 7.1730 3.9229 23.3575 13.1547 35.6973 11.2721 12.5499 185.9488 136.0228 16.6485 27.2836 14.1534 0.7038 4.9139 5.3491 29.4938 11.0660 18.6320 2.0978 4.8570 7.4158 16.5304 5.6795 1.8903 6.8271 3.0249 1.4284 1.3841 3.8712 3.4140 0.7843 18.6921 3.0250 1.7800 7.3739 13.9779 7.7402 10.8254 15.6347 4.8220 19.6067 16.4160 28.9281 68.5582 69.9153 232.3647 21.7530 36.9488 53.7956 51.8320 43.9987 39.4532 39.8573 50.2624 42.2993 36.3970 43.8585 2.1677 1.3489
temp: 298.150 k
press: 1.00000 atm
elementType: 7 7 6 6 6 6 6 6 1 1 1 1 1 1 1 1 1 1 1 1 1 1 1 1
symmnumber: 1
zpe: 573218.4 jmol-1
zpe.correction: 0.218327 hartree
zpe.thermalcorrener: 0.229119 hartree
zpe.thermalcorrenthalpy: 0.230063 hartree
zpe.thermalcorrgfe: 0.182944 hartree
zpe.sumelectzpe: -347.009003 hartree
zpe.sumelectthermal: -346.998211 hartree
zpe.sumelectthermalent: -346.997267 hartree
zpe.sumelectthermalfe: -347.044386 hartree
dipole: 1.0425 -1.8156 -0.9108
dipole: 2.2832
quadrupole: -50.8329 -58.3342 -50.1635
quadrupole: 3.2105 1.5730 -3.2388
quadrupole: 2.2773 -5.2240 2.9467 3.2105 1.5730 -3.2388
hfenergy: -347.2273303 hartree
pointgroup: C01 [X(C6H16N2)]
dipole: 0.4664323 -0.7034427 -0.3073879 debye
dipolederiv: -0.683176 0.0155535 0.0117786 0.0085137 -0.5610564 -0.0010211 0.0121723 0.0009225 -0.499721 -0.3570412 0.2879604 0.0436557 0.3207345 -0.9385101 0.0241889 0.0843421 0.0042303 -0.3913682 0.0357519 0.0326637 0.0248048 0.022733 -0.0893194 -0.0377721 0.0250741 -0.0557851 0.091376 0.388507 0.0682108 0.1173077 0.0457401 0.4344469 0.0727001 0.1046 0.091421 0.1108055 0.2311657 -0.0985356 -0.0424594 -0.1300515 0.4720893 -0.0694024 -0.0201206 -0.1587404 0.3370644 -0.0371103 -0.0312455 -0.0375266 -0.0312313 0.0104441 -0.0593051 0.0011351 -0.0275614 0.0549903 0.3639747 -0.0642458 -0.1926014 -0.0533272 0.3012535 0.009761 -0.2585123 0.0060148 0.2454565 0.1874195 -0.1506104 0.1075112 -0.1744788 0.3209999 -0.0442094 0.1287064 -0.0542926 0.3109478 0.0192739 0.0381207 -0.0619404 0.048976 -0.041962 0.1092756 -0.0448281 0.1010797 -0.1477666 -0.0640789 0.120145 0.0337009 -0.0137237 -0.2699164 -0.1064811 -0.0127264 -0.0459806 0.0337753 0.0408141 -0.00845 -0.0742058 -0.0222933 0.0335 0.0964802 -0.0686843 0.0426258 -0.1371902 -0.1652029 -0.009445 0.1524423 -0.011152 0.0159749 0.0570687 0.1054836 0.0325692 -0.0009482 0.0193327 -0.0509264 -0.1498214 -0.0637911 -0.0225324 -0.0443832 -0.1146194 -0.0372863 -0.0498393 0.0433691 0.0073498 -0.0480363 0.0592098 0.0334622 0.1484027 -0.0949091 0.0780776 -0.0902298 -0.1278948 -0.0669154 0.0925526 -0.0378395 0.0829515 0.0044651 0.1311206 0.0371471 0.0001722 0.0698877 0.104679 0.0326548 0.0524662 -0.1377926 -0.0866941 0.007426 -0.0908579 0.0525193 0.0506539 0.0626752 -0.1066379 0.045828 0.0625853 0.0708013 -0.031402 0.0931967 -0.1232788 -0.1139582 0.0618373 0.1202506 0.2302591 -0.1603721 -0.1229832 0.1078888 -0.0036675 -0.002372 -0.080835 -0.1192125 -0.0075993 -0.1300673 -0.0246359 -0.0548368 -0.0796349 -0.0904298 0.0581071 -0.0240746 0.1195836 -0.072915 0.1948352 -0.2185144 0.1013823 0.0042512 -0.0552972 -0.0105495 -0.0201992 0.003153 0.1666339 0.0116739 0.0727959 0.0412185 0.1340362 0.0255311 -0.0451145 -0.0672353 -0.0973436 -0.1176469 -0.1323343 -0.0236222 -0.0666047 -0.0561665 -0.0269844 0.0664941 0.1884743 -0.126059 -0.0585483 -0.1871073 0.2793617 -0.0624463 -0.1309061 0.0380554 0.0329821 0.102182 -0.0989428 0.0666457 -0.0535722 0.3683688 0.020395 0.0662734 0.096012 0.1036877 unknown
polarizability: 89.1157376|3.5464133|75.5735516|0.9688612|-0.8392931|74.7265668 unknown
InChI: InChI=1S/C6H16N2/c1-6(4-7)5-8(2)3/h6H,4-5,7H2,1-3H3
charge 0 multiplicity 1
24 atoms
N  1.376078 0.21686 -0.001336
N  -1.631201 1.650986 -0.33156
C  -0.960596 -0.758582 0.314162
C  0.321358 -0.670045 -0.551329
C  -1.471667 0.656811 0.74237
C  -2.044824 -1.544722 -0.459909
C  2.457977 0.448914 -0.981418
C  1.913917 -0.249307 1.29358
H  -0.735473 -1.321232 1.245193
H  0.707512 -1.710211 -0.725061
H  0.039322 -0.266501 -1.544608
H  -2.443082 0.535918 1.263047
H  -0.764645 1.085803 1.474485
H  -2.380049 -0.980073 -1.352654
H  -2.929826 -1.731202 0.175873
H  -1.665679 -2.523598 -0.810069
H  2.034733 0.863121 -1.914378
H  3.024211 -0.481218 -1.245021
H  3.178467 1.182295 -0.576411
H  2.389416 -1.261945 1.231081
H  1.112592 -0.295594 2.050348
H  2.676164 0.464837 1.653474
H  -2.313238 1.409424 -1.056193
H  -0.734568 1.967162 -0.713069
