program: Gaussian 09
title: 000110773
version: EM64L-G09RevD.01
frameworkgroup: C1[X(C15H19ClN2O)]
method: RPBEPBE
basis: SDD
operation: Freq
keyword: #p
keyword: freq=noraman
keyword: PBEPBE/SDD
title: #p freq=noraman PBEPBE/SDD
converged: YES YES NO NO
title: Mulliken charges:
elementType: Cl O N N C C C C C C C C C C C C C C C H H H H H H H H H H H H H H H H H H H
charge: -0.064982 -0.242634 -0.107289 -0.217027 -0.157595 -0.495070 -0.366068 -0.355440 -0.398507 -0.397434 -0.394259 -0.401146 0.107302 0.447436 -0.329230 -0.353740 -0.216888 -0.220435 -0.112918 0.244562 0.231815 0.231807 0.242324 0.183544 0.176924 0.201961 0.202598 0.197206 0.194211 0.203223 0.238271 0.251333 0.192069 0.215423 0.311057 0.249426 0.254908 0.253264
chargesum: 0.00000
title: Mulliken charges with hydrogens summed into heavy atoms:
elementType: Cl O N N C C C C C C C C C C C C C C C
charge: -0.064982 -0.242634 -0.107289 -0.217027 0.086966 -0.031448 0.059799 0.023445 0.001297 0.000000 0.095345 0.006346 0.107302 0.447436 -0.018173 -0.104314 0.038020 0.032829 -0.112918
polarizability: 2.71926624e+02 1.76374020e+01 1.48261960e+02 1.49972998e+01 -1.76415140e+01 1.49435620e+02
1716.lowfreq: 0.0016 0.0018 0.0024 1.9028 4.9613 9.4010 24.8667 43.0685 45.6386
frequency: 24.8046 42.8505 45.4808 71.6487 106.2484 123.6867 153.1864 175.1937 207.2302 235.4746 249.3856 264.0721 280.9526 307.8149 347.0451 351.2823 388.6788 399.4609 413.2957 425.0174 444.3224 466.7969 502.9644 524.9605 579.8065 625.9288 659.9666 673.5798 684.9969 704.5804 728.4102 786.3709 806.0471 810.6387 842.5047 844.2181 854.2229 877.9789 905.6714 923.4186 936.7030 948.4955 960.2849 981.1727 984.5901 992.8002 1029.5098 1036.0356 1061.9639 1075.9666 1079.3943 1095.5668 1104.0172 1121.1314 1124.5485 1144.7515 1155.1406 1192.0205 1196.6637 1200.4299 1205.5680 1224.3835 1258.3721 1269.7573 1273.0439 1288.8542 1298.4496 1306.9698 1317.4464 1323.2017 1334.1546 1343.3626 1352.1772 1359.7029 1360.3073 1381.1166 1389.5060 1411.1906 1452.4022 1457.1948 1461.4336 1467.5682 1470.1853 1480.8462 1483.4439 1487.2927 1577.3572 1604.2652 1619.7899 2837.2100 2866.9173 2911.1332 2970.1650 2985.2367 2986.3100 2997.3592 3020.3990 3032.2500 3036.9847 3045.5531 3054.8115 3063.4230 3075.7674 3101.9224 3157.5371 3164.4506 3177.4234 3193.0499
redmass: 6.6261 3.2257 3.4181 6.2864 3.5084 6.8944 3.7225 5.0511 3.2953 2.8335 3.0090 5.0005 2.3489 4.9174 3.2212 5.0739 3.1706 2.3165 3.0425 3.8627 2.9700 5.5785 2.3362 2.3697 3.1340 7.0308 5.2528 3.8125 5.1570 3.6457 3.6150 3.5999 1.5952 1.4101 1.6863 2.1278 1.4192 1.9738 2.9958 2.8644 1.3493 1.9298 1.5032 1.3644 2.3900 4.3315 2.1032 2.1091 1.8886 2.0197 2.0801 2.5654 2.4288 2.9328 1.5276 2.1005 1.3051 1.2411 1.1892 1.3709 2.8743 2.1020 1.2475 1.4533 1.1781 1.2042 1.5553 1.3753 1.6624 1.4673 1.3179 1.4274 1.5433 2.3039 1.6404 3.1456 1.4403 3.3176 1.0896 1.0967 1.0879 1.0949 1.0842 1.4570 1.0989 1.6063 7.6827 6.0387 10.2680 1.0712 1.0713 1.0830 1.0624 1.0610 1.0616 1.0591 1.0668 1.0896 1.0936 1.1028 1.1032 1.1035 1.0892 1.1006 1.0878 1.0911 1.0965 1.0954
irintensity: 0.1133 0.3033 0.1199 1.5904 0.2217 2.8060 4.6005 1.8686 0.1677 1.5653 0.4939 3.9486 0.6811 0.9138 10.3607 1.9760 3.3682 1.0017 0.0656 4.8104 0.5079 19.9593 14.1760 7.5680 1.0379 0.1987 6.9416 10.3360 6.5102 0.9229 5.6057 31.6617 2.0650 33.4700 52.2094 16.2764 4.7222 3.5087 5.9473 11.6805 0.2798 9.2643 3.8296 1.1138 24.5074 28.4225 5.2687 16.2733 6.0643 45.4887 9.7281 0.2484 23.3869 5.2897 20.8590 15.0343 5.2187 1.3373 17.0111 5.6393 37.0694 37.2688 4.6912 0.9318 11.8129 7.7709 29.0929 2.2171 94.9218 48.3487 1.5993 1.0643 21.2999 47.6664 21.0980 39.5556 0.8396 7.7897 7.1307 8.8513 12.9684 20.7847 7.9401 209.5673 6.5610 108.4602 1.7662 35.8908 227.5958 85.2923 73.7299 74.5574 39.3220 36.7553 29.4305 28.2008 22.3957 76.2888 50.0205 20.0786 85.0495 26.6846 24.9730 33.7900 6.4482 2.9137 5.8444 9.3633
temp: 298.150 k
press: 1.00000 atm
elementType: 17 8 7 7 6 6 6 6 6 6 6 6 6 6 6 6 6 6 6 1 1 1 1 1 1 1 1 1 1 1 1 1 1 1 1 1 1 1
symmnumber: 1
zpe: 826731.0 jmol-1
zpe.correction: 0.314885 hartree
zpe.thermalcorrener: 0.331823 hartree
zpe.thermalcorrenthalpy: 0.332767 hartree
zpe.thermalcorrgfe: 0.269024 hartree
zpe.sumelectzpe: -1226.366234 hartree
zpe.sumelectthermal: -1226.349296 hartree
zpe.sumelectthermalent: -1226.348352 hartree
zpe.sumelectthermalfe: -1226.412095 hartree
dipole: 3.6655 2.8995 -2.0158
dipole: 5.0898
quadrupole: -126.3251 -114.2062 -122.5361
quadrupole: -0.2814 -0.4634 -2.2620
quadrupole: -5.3026 6.8163 -1.5137 -0.2814 -0.4634 -2.2620
hfenergy: -1226.6811192 hartree
pointgroup: C01 [X(C15H19Cl1N2O1)]
dipole: -1.3768582 -1.3320831 -0.5828815 debye
polarizability: 269.3725488|21.7509815|155.9241614|-20.149924|15.6293482|144.3274928 unknown
InChI: InChI=1S/C15H19ClN2O/c16-12-4-6-13(7-5-12)18-11-8-14(15(18)19)17-9-2-1-3-10-17/h4-7,14H,1-3,8-11H2
charge 0 multiplicity 1
38 atoms
Cl 6.225999 1.151534 -0.743279
O  -0.196006 0.837633 2.011318
N  -2.597387 -0.225878 0.027716
N  0.570064 -0.741543 0.400278
C  -1.724913 -0.896511 1.04556
C  -1.24432 -2.274257 0.529455
C  -2.69154 1.258344 0.174228
C  -3.9632 -0.826931 0.03889
C  -3.50739 1.864379 -0.985625
C  -4.821032 -0.289002 -1.123604
C  0.014259 -1.93155 -0.299478
C  -4.922843 1.250951 -1.057878
C  -0.386817 -0.14226 1.236867
C  1.89314 -0.277931 0.148749
C  2.485684 0.757138 0.928778
C  2.646991 -0.860054 -0.908933
C  3.798987 1.189222 0.65431
C  3.961457 -0.428777 -1.181698
C  4.523784 0.59152 -0.3941
H  -2.227993 -0.958261 2.038634
H  -1.99842 -2.795122 -0.079998
H  -0.971528 -2.922466 1.382268
H  -1.676898 1.686763 0.178159
H  -3.164752 1.534645 1.15068
H  -4.480201 -0.606161 1.01044
H  -3.87699 -1.925558 -0.039997
H  -2.971147 1.671866 -1.935341
H  -3.562976 2.96155 -0.850468
H  -5.825495 -0.752782 -1.079987
H  -4.353145 -0.589712 -2.081108
H  0.750938 -2.753387 -0.299274
H  -0.246196 -1.675383 -1.343536
H  -5.497828 1.543237 -0.154799
H  -5.474349 1.642742 -1.933202
H  1.911855 1.215464 1.735867
H  2.214449 -1.641757 -1.538997
H  4.249394 1.983165 1.257106
H  4.532564 -0.879769 -1.9981
