program: Gaussian 09
title: 000110772
version: EM64L-G09RevD.01
frameworkgroup: C1[X(C15H20N2O2)]
method: RPBEPBE
basis: SDD
operation: Freq
keyword: #p
keyword: freq=noraman
keyword: PBEPBE/SDD
title: #p freq=noraman PBEPBE/SDD
converged: YES YES NO NO
title: Mulliken charges:
elementType: O O N N C C C C C C C C C C C C C C C H H H H H H H H H H H H H H H H H H H H
charge: -0.252405 -0.435560 -0.106410 -0.212381 -0.157213 -0.494806 -0.365392 -0.355140 -0.398273 -0.397110 -0.393095 -0.401065 0.101414 0.436675 -0.314981 -0.344120 -0.391601 -0.370611 0.289954 0.241228 0.229317 0.229729 0.243956 0.181382 0.175311 0.201666 0.202404 0.195392 0.192717 0.202949 0.236470 0.248426 0.191298 0.214054 0.306473 0.245532 0.220257 0.249913 0.353644
chargesum: 0.00000
title: Mulliken charges with hydrogens summed into heavy atoms:
elementType: O O N N C C C C C C C C C C C C C C C
charge: -0.252405 -0.081916 -0.106410 -0.212381 0.084016 -0.035760 0.059945 0.021837 -0.000477 -0.001444 0.091801 0.004287 0.101414 0.436675 -0.008508 -0.098588 -0.171345 -0.120698 0.289954
polarizability: 2.53828205e+02 1.73153755e+01 1.52214049e+02 1.59255937e+01 -1.83056788e+01 1.46804366e+02
1716.lowfreq: -6.5034 -3.0892 -0.0006 -0.0004 0.0006 6.5150 26.5849 44.9955 56.6047
frequency: 26.4920 44.8088 55.8378 79.2647 113.9395 133.9633 162.7608 185.5174 214.1254 244.7981 262.3428 283.1267 309.9439 340.9308 346.5604 353.8062 376.6638 399.6738 413.1145 420.6938 433.9324 445.0045 504.8304 525.7028 546.1271 610.6656 636.3314 660.4756 682.4078 706.7523 714.5516 777.8895 805.0820 808.7123 810.5907 825.5290 843.9888 854.3853 879.0730 905.2793 922.9611 935.4933 948.4132 960.9588 967.0304 984.6033 1000.6964 1030.9199 1037.5354 1061.6359 1077.7666 1096.0794 1103.6742 1116.0788 1121.1444 1145.1510 1147.3549 1154.7475 1187.5533 1193.3216 1200.5917 1208.3441 1225.4810 1247.3521 1258.4795 1266.1479 1272.5784 1288.1013 1303.9458 1315.1029 1322.0706 1327.2214 1334.5535 1344.3728 1352.0334 1358.2877 1368.7792 1386.3035 1393.5460 1437.0360 1455.4767 1459.1291 1463.9705 1468.6031 1471.3753 1482.1195 1484.0658 1506.8369 1592.7409 1614.0037 1631.2721 2834.1201 2865.1138 2909.3036 2969.4470 2984.2447 2986.1858 2994.3916 3018.9567 3031.9988 3036.1293 3044.6733 3053.7663 3061.0491 3076.4846 3099.9963 3117.4790 3154.7273 3176.0438 3190.5544 3585.2545
redmass: 5.7081 3.5175 3.0154 5.0941 3.5362 5.7146 3.3257 4.2706 2.9489 2.9724 2.7459 2.1840 7.8418 4.6930 1.1208 2.7716 5.1795 1.9182 3.0408 3.9638 3.9632 2.9846 2.3737 2.4918 2.8337 4.1547 6.5770 5.5742 4.0996 3.1170 3.8961 4.2388 2.3045 1.2887 2.3580 1.6658 2.8370 1.4213 1.9791 2.9382 2.8429 1.3578 1.9873 1.4780 1.3110 2.5597 2.8400 2.0862 2.0604 1.8764 1.6809 2.4245 2.3631 1.7418 2.9385 1.9086 1.4873 1.2538 1.1570 1.2285 1.3423 2.8871 2.2125 2.2858 1.2541 1.4902 1.1663 1.2068 1.7011 1.6322 1.4749 1.3842 1.3008 1.4167 1.5016 1.4181 2.6048 1.4548 4.0066 3.3517 1.0890 1.0990 1.0878 1.0967 1.0824 1.1230 1.0972 2.6069 6.3640 9.9167 6.3868 1.0710 1.0713 1.0829 1.0621 1.0614 1.0613 1.0596 1.0667 1.0916 1.0917 1.1027 1.1032 1.1027 1.0890 1.1005 1.0909 1.0875 1.0966 1.0942 1.0660
irintensity: 0.4648 0.6855 0.6189 1.5666 0.1241 5.7306 7.0674 2.3106 0.1776 1.8914 0.9726 0.9064 0.4142 0.9718 144.8593 6.4382 5.3708 3.6215 0.9970 11.8355 2.7546 0.1515 11.9360 21.4279 7.1662 4.4682 0.6026 7.7518 4.0809 8.9065 0.4077 8.1699 17.9953 0.3783 18.6879 93.8731 9.6502 4.1339 2.2068 4.9755 7.2938 0.2733 12.4314 4.8521 4.1616 24.6117 2.8944 3.6574 14.9628 7.2680 21.7515 3.7931 22.7136 118.2024 11.5834 101.4711 115.7734 4.3578 8.4931 1.8814 6.3508 28.3041 41.5527 59.4288 5.3506 1.3323 11.5500 6.2548 10.5001 68.8104 36.0818 4.5967 1.2239 0.5421 7.6594 0.3857 49.5688 3.7843 40.0067 24.1530 8.0878 6.4220 12.1756 19.4948 11.8420 43.8815 5.6090 276.7198 11.4295 257.7890 7.1545 88.1230 73.5010 77.7472 39.5330 35.8711 33.5004 30.6342 25.1171 79.1922 47.7471 18.4731 87.6557 28.8008 23.0411 36.1854 21.2266 10.5169 6.6455 8.1702 49.5031
temp: 298.150 k
press: 1.00000 atm
elementType: 8 8 7 7 6 6 6 6 6 6 6 6 6 6 6 6 6 6 6 1 1 1 1 1 1 1 1 1 1 1 1 1 1 1 1 1 1 1 1
symmnumber: 1
zpe: 861123.7 jmol-1
zpe.correction: 0.327985 hartree
zpe.thermalcorrener: 0.344848 hartree
zpe.thermalcorrenthalpy: 0.345792 hartree
zpe.thermalcorrgfe: 0.283066 hartree
zpe.sumelectzpe: -842.116227 hartree
zpe.sumelectthermal: -842.099363 hartree
zpe.sumelectthermalent: -842.098419 hartree
zpe.sumelectthermalfe: -842.161145 hartree
dipole: 1.2732 1.6172 -0.8940
dipole: 2.2440
quadrupole: -105.0109 -105.2034 -118.4871
quadrupole: 8.6642 -6.0604 -1.9791
quadrupole: 4.5563 4.3637 -8.9200 8.6642 -6.0604 -1.9791
hfenergy: -842.4442115 hartree
pointgroup: C01 [X(C15H20N2O2)]
dipole: -0.4777889 -0.6792272 -0.2996978 debye
polarizability: 253.1664177|18.5702297|156.3978942|-16.7326015|17.2258889|143.2823078 unknown
InChI: InChI=1S/C15H20N2O2/c18-13-6-4-12(5-7-13)17-11-8-14(15(17)19)16-9-2-1-3-10-16/h4-7,14,18H,1-3,8-11H2
charge 0 multiplicity 1
39 atoms
O  -0.183843 0.871793 1.992339
O  5.863681 1.020794 -0.764661
N  -2.586294 -0.234661 0.036792
N  0.589117 -0.724086 0.402113
C  -1.701538 -0.888965 1.05486
C  -1.214279 -2.268149 0.548935
C  -2.690341 1.24973 0.168486
C  -3.947165 -0.844766 0.060564
C  -3.514009 1.83814 -0.995014
C  -4.813475 -0.325752 -1.104502
C  0.042804 -1.925821 -0.28277
C  -4.925487 1.214239 -1.055839
C  -0.367376 -0.122506 1.23095
C  1.912163 -0.25417 0.140171
C  2.500534 0.794059 0.901571
C  2.670307 -0.842969 -0.911356
C  3.808996 1.230188 0.614421
C  3.977566 -0.406934 -1.194042
C  4.552476 0.631762 -0.430173
H  -2.198944 -0.945468 2.051282
H  -1.966059 -2.798119 -0.055924
H  -0.937847 -2.907894 1.407059
H  -1.678644 1.684736 0.166117
H  -3.163002 1.532709 1.143561
H  -4.462523 -0.616714 1.031628
H  -3.853802 -1.943677 -0.006104
H  -2.979408 1.638799 -1.944277
H  -3.576792 2.936434 -0.87151
H  -5.814807 -0.795599 -1.052063
H  -4.346876 -0.633982 -2.060285
H  0.785511 -2.742353 -0.272161
H  -0.21753 -1.685559 -1.330851
H  -5.499149 1.512467 -0.153762
H  -5.483054 1.592434 -1.933462
H  1.924616 1.258306 1.703812
H  2.241369 -1.637331 -1.528488
H  4.24566 2.040353 1.213241
H  4.559621 -0.856924 -2.003397
H  6.171021 1.755357 -0.17786
