program: Gaussian 09
title: 000110769
version: EM64L-G09RevD.01
frameworkgroup: C1[X(C18H20N2O)]
method: RPBEPBE
basis: SDD
operation: Freq
keyword: #p
keyword: freq=noraman
keyword: PBEPBE/SDD
title: #p freq=noraman PBEPBE/SDD
converged: YES YES NO NO
title: Mulliken charges:
elementType: O N N C C C C C C C C C C C C C C C C C C H H H H H H H H H H H H H H H H H H H H
charge: -0.254776 -0.223317 -0.331300 -0.175712 -0.466514 -0.403731 0.122955 -0.360172 0.430724 -0.585225 -0.341577 -0.365112 0.495259 -0.226363 -0.235696 -0.414431 -0.409349 -0.248087 -0.227826 -0.228765 -0.243640 0.230231 0.249722 0.228369 0.233738 0.243375 0.290278 0.216989 0.199123 0.228127 0.203158 0.304983 0.242917 0.227268 0.224598 0.233696 0.232426 0.229100 0.223473 0.223879 0.227204
chargesum: 0.00000
title: Mulliken charges with hydrogens summed into heavy atoms:
elementType: O N N C C C C C C C C C C C C C C C C C C
charge: -0.254776 -0.223317 -0.041023 0.054519 0.011578 0.073381 0.122955 0.055940 0.430724 -0.153940 -0.036594 -0.122195 0.495259 0.000905 -0.011097 -0.180735 -0.176923 -0.018987 -0.004353 -0.004886 -0.016436
polarizability: 3.16922614e+02 -9.93751057e+00 1.86780947e+02 1.47530259e+01 5.41116489e+00 1.28425365e+02
1716.lowfreq: -4.9860 0.0002 0.0008 0.0010 2.1436 8.2140 19.5654 21.4665 27.1168
frequency: 18.7917 19.5635 26.9276 46.1153 57.4117 68.3241 96.0639 114.0846 157.0862 175.0570 185.9044 203.2280 277.3073 299.8495 324.1887 338.0014 346.6372 375.7238 403.0486 408.5535 435.3049 500.4951 521.9168 548.2482 575.1250 605.1419 615.8251 618.2775 638.0212 684.8372 694.1404 696.9826 705.5896 743.1923 764.6765 767.3600 798.8693 815.0054 839.7654 854.4669 879.6474 889.1381 916.4161 917.5255 967.4076 974.7779 975.6067 984.3342 989.9597 993.5296 999.2781 999.8948 1018.0090 1026.4034 1032.6489 1043.3102 1071.6722 1078.1525 1088.1532 1105.9781 1116.8088 1163.7745 1171.4198 1173.1155 1174.4589 1187.3196 1194.1603 1197.9070 1201.7896 1218.5910 1219.5264 1256.3405 1271.2963 1284.8730 1294.0463 1307.8161 1326.4249 1328.8768 1334.9563 1366.3566 1375.2422 1382.8312 1388.3163 1440.9543 1447.3285 1459.1216 1471.8651 1477.3304 1484.4674 1488.4451 1494.5632 1496.5157 1586.3105 1593.6018 1613.5044 1614.9889 1628.3062 2814.7410 2856.7959 2979.3446 2981.5297 3001.7057 3025.4348 3053.0376 3055.4756 3097.9332 3113.9370 3115.4462 3128.0859 3131.1605 3138.2690 3142.8526 3155.7854 3161.6382 3168.0485 3191.5603 3409.0936
redmass: 4.7999 4.0116 5.4960 3.3768 5.0950 4.0219 3.3013 2.9643 3.9085 3.9366 4.5513 2.6642 4.5478 4.0962 5.1055 2.4377 5.4241 4.7302 2.8169 2.9390 3.0155 3.5003 3.0306 4.0854 4.0303 4.6533 6.2684 6.3607 4.6855 1.4578 5.6223 1.9909 1.7503 2.8622 2.0439 1.7534 1.1886 3.5316 1.2693 1.2464 2.7081 1.8098 1.4383 1.4540 2.6238 1.3743 1.3883 5.7313 6.2667 1.3130 2.3238 1.3615 1.6480 2.2579 2.2432 3.1671 2.3535 2.2862 1.6251 2.1886 2.0225 1.3404 1.2510 1.6447 1.0519 1.1211 1.6454 1.3104 1.2811 2.3121 1.9973 1.2952 1.1570 1.3492 1.5849 1.8665 1.2858 1.5035 1.4555 1.5771 2.7363 7.9012 3.9705 2.1784 2.4199 1.2742 1.0947 1.1427 2.1542 1.9572 1.1102 1.1943 6.2071 6.0755 5.9652 6.1980 9.7279 1.0789 1.0710 1.0637 1.0649 1.0838 1.0621 1.1008 1.0990 1.1058 1.0870 1.0869 1.0849 1.0908 1.0898 1.0959 1.0937 1.1015 1.0991 1.0951 1.0739
irintensity: 0.1331 0.2634 0.5347 0.0579 2.3241 0.3559 1.8413 1.3034 0.9563 4.4088 1.0220 1.8217 4.3318 0.7084 0.6493 0.4160 14.9008 1.0488 0.0021 0.0562 5.2955 12.8922 24.9502 7.8489 8.8427 3.0097 0.9372 0.1126 5.1923 50.1791 12.4966 44.3461 45.2745 15.5550 44.6418 87.2964 0.7373 5.4543 0.4177 0.0231 5.2710 18.6338 4.7331 6.0695 0.6308 0.7851 0.0620 0.1072 0.0514 0.1741 9.5974 2.0067 0.8826 5.6191 10.2359 3.1710 5.9109 6.4748 8.7044 41.6409 3.7544 2.3551 27.8468 68.7582 0.4323 0.2477 7.8938 0.1151 18.5337 2.2097 32.6314 17.7714 6.5418 2.1413 28.4902 90.0724 12.5697 89.7460 49.0011 28.8185 96.2731 0.1106 39.4663 6.9953 8.0525 75.1733 10.9831 14.1309 17.1729 164.5439 5.1357 3.4100 0.8861 1.3514 113.0451 7.3985 203.7188 70.4261 99.2788 38.4358 19.6128 31.2448 25.7770 22.0119 22.9092 26.7397 9.9150 7.0205 1.5521 11.7540 16.1572 45.8927 37.6956 25.6550 14.0452 9.6334 16.5862
temp: 298.150 k
press: 1.00000 atm
elementType: 8 7 7 6 6 6 6 6 6 6 6 6 6 6 6 6 6 6 6 6 6 1 1 1 1 1 1 1 1 1 1 1 1 1 1 1 1 1 1 1 1
symmnumber: 1
zpe: 892847.1 jmol-1
zpe.correction: 0.340068 hartree
zpe.thermalcorrener: 0.358648 hartree
zpe.thermalcorrenthalpy: 0.359593 hartree
zpe.thermalcorrgfe: 0.289812 hartree
zpe.sumelectzpe: -881.133530 hartree
zpe.sumelectthermal: -881.114949 hartree
zpe.sumelectthermalent: -881.114005 hartree
zpe.sumelectthermalfe: -881.183785 hartree
dipole: 0.0674 3.3984 -1.1429
dipole: 3.5860
quadrupole: -113.6447 -118.5219 -126.7107
quadrupole: 4.9372 2.1991 1.0871
quadrupole: 5.9811 1.1039 -7.0849 4.9372 2.1991 1.0871
hfenergy: -881.4735978 hartree
pointgroup: C01 [X(C18H20N2O1)]
dipole: -0.0141072 -1.3397495 -0.4420188 debye
polarizability: 317.1668226|-8.9274772|186.5602386|-14.0725575|-5.8942644|128.4018655 unknown
InChI: InChI=1S/C18H20N2O/c21-18-17(19-13-11-15-7-3-1-4-8-15)12-14-20(18)16-9-5-2-6-10-16/h1-10,17,19H,11-14H2
charge 0 multiplicity 1
41 atoms
O  -1.674356 1.746413 -0.042153
N  -2.643477 -0.436639 -0.15204
N  0.801488 0.360782 0.351897
C  -0.27727 -0.271502 -0.410063
C  -0.62644 -1.720907 0.002017
C  -2.143087 -1.833522 -0.291805
C  -1.596959 0.491412 -0.175505
C  2.168965 0.041762 -0.098818
C  -4.041703 -0.15066 -0.085007
C  3.214481 0.794707 0.761518
C  -4.518852 1.15939 0.205051
C  -4.980224 -1.196339 -0.30878
C  4.639009 0.436751 0.366052
C  -5.906466 1.399376 0.271772
C  -6.365248 -0.938489 -0.235548
C  5.3151 -0.640999 0.994671
C  5.308082 1.140427 -0.668668
C  -6.840269 0.359319 0.056533
C  6.621624 -1.00837 0.600606
C  6.614694 0.777543 -1.066973
C  7.276429 -0.300158 -0.433761
H  -0.088098 -0.241494 -1.516794
H  -0.429112 -1.822958 1.083206
H  -0.047796 -2.486346 -0.540357
H  -2.342571 -2.208701 -1.315253
H  -2.657305 -2.494777 0.42667
H  0.628388 1.374923 0.434663
H  2.336315 -1.048233 0.006434
H  2.337702 0.287118 -1.178443
H  3.023743 0.54581 1.821607
H  3.047545 1.88473 0.647406
H  -3.801996 1.966195 0.367378
H  -4.641986 -2.207962 -0.551689
H  -6.257998 2.412473 0.497363
H  -7.072455 -1.756811 -0.411669
H  4.81544 -1.190313 1.802725
H  4.804129 1.982832 -1.159476
H  -7.915976 0.556783 0.113099
H  7.12981 -1.840335 1.101726
H  7.117229 1.335862 -1.865235
H  8.290971 -0.580695 -0.738554
