program: Gaussian 09
title: 000110757
version: EM64L-G09RevD.01
frameworkgroup: C1[X(C9H6O6)]
method: RPBEPBE
basis: SDD
operation: Freq
keyword: #p
keyword: freq=noraman
keyword: PBEPBE/SDD
title: #p freq=noraman PBEPBE/SDD
converged: YES YES NO NO
title: Mulliken charges:
elementType: O O O O O O C C C C C C C C C H H H H H H
charge: -0.189687 -0.188049 -0.142307 -0.140898 -0.126046 -0.139899 -0.307409 -0.294683 -0.283057 -0.230355 -0.506893 0.188997 0.174187 0.181184 0.169422 0.338847 0.329393 0.312968 0.307280 0.252456 0.294550
chargesum: 0.00000
title: Mulliken charges with hydrogens summed into heavy atoms:
elementType: O O O O O O C C C C C C C C C
charge: -0.189687 -0.188049 -0.142307 -0.140898 -0.126046 -0.139899 0.031438 0.034710 0.029910 0.076925 0.040113 0.188997 0.174187 0.181184 0.169422
polarizability: 1.10635693e+02 1.27396602e+00 1.19343091e+02 2.12063996e-01 1.56428824e+00 7.80762373e+01
1716.lowfreq: -17.0465 -9.2618 -0.0009 -0.0008 -0.0006 5.3151 31.3601 66.3369 123.0296
frequency: 31.2996 66.2807 123.0238 125.8026 136.8616 142.8217 202.4306 275.2077 361.0298 373.7563 457.0915 466.5513 503.2240 552.4949 577.1397 578.1807 628.3647 632.8638 660.2503 688.6178 713.8504 758.9016 788.9585 806.4675 825.2057 845.7991 897.0164 926.6473 935.3576 938.3724 1036.3926 1048.3638 1074.7416 1085.0257 1108.5044 1115.4579 1173.2846 1183.9735 1218.2630 1232.8041 1250.5187 1261.2546 1280.1897 1288.8926 1299.7159 1335.7073 1476.6100 1701.5950 1709.3998 1770.9600 1781.2740 3025.4403 3029.5937 3045.4424 3058.2382 3081.7084 3106.5543
redmass: 10.3234 5.3499 10.0207 14.6811 12.7115 7.3490 10.8430 2.9196 10.5889 11.0249 6.7322 8.3008 5.7941 6.3319 12.8179 10.1880 4.2914 7.8655 6.0086 7.7899 5.9627 6.3128 5.5670 9.7832 7.6809 6.9009 2.8098 2.0504 3.3443 3.4061 2.4616 2.8607 1.8058 2.0329 8.2692 7.2128 1.5346 1.8454 1.2818 1.4548 1.5244 1.4079 1.5184 1.4234 1.5476 1.3279 1.0785 12.9611 12.9657 12.7646 12.7805 1.0830 1.0660 1.0841 1.0857 1.0884 1.1019
irintensity: 1.1567 6.0545 15.8700 0.9133 1.5332 7.1743 0.7436 2.3463 14.9791 6.4837 0.9240 4.9349 19.9111 24.8586 3.1638 2.4418 4.3652 14.4793 5.4456 12.6800 21.5069 19.5023 37.2244 142.9257 118.5232 208.2300 16.0262 2.4474 71.8118 114.1103 61.4949 68.7691 21.2284 6.9087 284.8069 6.7723 19.8234 29.1980 3.4330 4.7701 0.2558 0.2573 3.9338 5.7323 1.2056 1.3363 17.8177 379.0626 565.8147 175.6668 43.7293 4.0054 11.0905 3.8347 5.0858 1.2728 3.1844
temp: 298.150 k
press: 1.00000 atm
elementType: 8 8 8 8 8 8 6 6 6 6 6 6 6 6 6 1 1 1 1 1 1
symmnumber: 1
zpe: 369644.7 jmol-1
zpe.correction: 0.140790 hartree
zpe.thermalcorrener: 0.152497 hartree
zpe.thermalcorrenthalpy: 0.153441 hartree
zpe.thermalcorrgfe: 0.101607 hartree
zpe.sumelectzpe: -796.838299 hartree
zpe.sumelectthermal: -796.826592 hartree
zpe.sumelectthermalent: -796.825648 hartree
zpe.sumelectthermalfe: -796.877483 hartree
dipole: 0.3186 -0.9124 1.4178
dipole: 1.7159
quadrupole: -116.4090 -98.8524 -81.3176
quadrupole: 1.3235 7.0961 -1.8770
quadrupole: -17.5493 0.0073 17.5420 1.3235 7.0961 -1.8770
hfenergy: -796.9790896 hartree
pointgroup: C01 [X(C9H6O6)]
dipole: -0.1201495 -0.3597208 -0.5584642 debye
dipolederiv: -0.7434538 0.283281 -0.1148891 0.3451469 -1.3864205 0.5729093 -0.0352314 0.5887508 -0.4788061 -0.5840951 -0.2195728 0.0440076 -0.3040151 -1.5722675 -0.5081077 0.1588969 -0.5088335 -0.4450155 -0.5122297 -0.0448521 0.0534633 -0.0099673 -0.8643887 0.3178101 0.0657063 0.4140212 -0.5159243 -0.5002349 0.0822276 0.0948218 0.0670743 -0.9220979 -0.2793172 0.1534796 -0.3870359 -0.4963334 -0.7374185 0.3239827 -0.192793 0.3116605 -0.7784097 0.2796731 -0.1171515 0.2422171 -0.4041916 -0.606414 -0.2873118 -0.0113939 -0.316567 -0.9516958 -0.1831283 0.0693764 -0.08552 -0.3561849 -0.1460224 -0.0473145 0.0935298 -0.0995506 -0.0215989 0.0695826 0.2978085 0.0852035 -0.0354482 -0.2719867 0.0412289 0.1393238 0.0085016 -0.0217955 -0.0418554 0.2239738 -0.0421293 -0.0107644 -0.4247232 0.0047715 -0.0470921 -0.0035455 -0.001365 0.0041734 -0.1289987 0.0129911 0.0767201 -0.2974454 -0.0161753 0.1433231 -0.0433698 -0.036824 -0.0188575 0.1416561 -0.0325309 0.0195537 0.1778768 -0.013289 -0.0154451 0.0209812 0.0496632 0.0035173 0.116668 0.0298793 0.1025965 1.1465232 -0.4727233 0.0704015 -0.1601374 1.3926116 -0.6135469 -0.2720704 -0.6456208 0.6312611 1.041159 0.4313372 -0.1195804 0.1710263 1.6621862 0.5465298 -0.4637687 0.441151 0.568188 1.1947083 -0.0227786 0.0722 -0.4022059 1.5198649 -0.6812215 0.158701 -0.7372381 0.5826167 0.9185971 0.0304166 -0.2992354 0.4464979 1.6702576 0.4733832 -0.3108934 0.5946224 0.6182061 0.0930911 0.0028728 0.0046197 -0.0387109 0.0414179 -0.0366755 -0.0368861 -0.0432754 0.0433777 0.1154572 -0.0126671 0.0142125 0.0459971 0.029182 0.0238791 -0.0279473 0.0347797 0.0626009 0.0637695 -0.028887 0.0403886 -0.0099622 0.045994 0.0370122 0.0340409 0.0266519 -0.0126578 0.0460201 -0.0097627 -0.0303586 -0.0125136 0.083331 0.0018782 -0.0526509 -0.0173632 -0.0107989 -0.0373659 0.0278539 0.0749565 -0.0006764 0.0916927 0.0242794 0.0490086 -0.0066388 -0.0213576 0.0641874 -0.0526383 -0.0144607 -0.0156641 -0.0293377 0.0080822 -0.0237176 0.035918 0.0823617 unknown
polarizability: 110.7054149|-1.4966147|119.2868463|0.0308295|-1.385995|78.0627601 unknown
InChI: InChI=1S/C9H6O6/c10-6-2-1-3-5(4(2)8(12)14-6)9(13)15-7(3)11/h2-5H,1H2
charge 0 multiplicity 1
21 atoms
O  2.886678 0.270429 -0.191776
O  -2.851891 -0.018766 0.471848
O  1.921441 2.177449 -1.147064
O  -2.159901 2.114476 1.124547
O  3.158682 -1.782408 0.909774
O  -2.886164 -2.187668 -0.397371
C  0.570636 0.692109 0.353506
C  -0.752214 0.7848 -0.455149
C  0.869384 -0.808852 0.585375
C  -1.022507 -0.638864 -1.010934
C  0.197115 -1.533395 -0.632727
C  1.800132 1.184993 -0.428728
C  -1.946031 1.104115 0.455363
C  2.391473 -0.906628 0.52001
C  -2.321206 -1.09647 -0.333575
H  0.520612 1.281178 1.288249
H  -0.676975 1.573522 -1.223771
H  0.502659 -1.207939 1.543767
H  -1.194719 -0.656426 -2.100671
H  0.894524 -1.578808 -1.487888
H  -0.10173 -2.565647 -0.391084
