program: Gaussian 09
title: 000001199
version: EM64L-G09RevD.01
frameworkgroup: C1[X(C15H14ClNO4S)]
method: RPBEPBE
basis: SDD
operation: Freq
keyword: #p
keyword: freq=noraman
keyword: PBEPBE/SDD
title: #p freq=noraman PBEPBE/SDD
converged: YES YES NO NO
title: Mulliken charges:
elementType: Cl S O O O O N C C C C C C C C C C C C C C C H H H H H H H H H H H H H H
charge: -0.062826 0.937078 -0.536166 -0.496744 -0.411897 -0.231531 -0.452798 -0.014580 0.392884 -0.481689 -0.249105 -0.247658 0.450424 -0.351076 -0.268235 -0.346921 -0.378232 0.230935 -0.056549 -0.218860 -0.798207 -0.229291 0.309728 0.281079 0.288257 0.277216 0.281675 0.305522 0.244810 0.244540 0.238945 0.229278 0.233489 0.244011 0.259397 0.383097
chargesum: 0.00000
title: Mulliken charges with hydrogens summed into heavy atoms:
elementType: Cl S O O O O N C C C C C C C C C C C C C C C
charge: -0.062826 0.937078 -0.536166 -0.496744 -0.028801 -0.231531 -0.452798 -0.014580 0.392884 0.109117 0.039152 0.029558 0.450424 -0.069400 0.037288 -0.102111 -0.133692 0.230935 -0.056549 0.020085 -0.091429 0.030106
polarizability: 2.43724348e+02 1.81819058e+01 2.22759056e+02 -2.00586620e+01 1.54334203e+01 1.83946555e+02
1716.lowfreq: -20.9946 -1.3643 -0.0014 -0.0014 -0.0011 4.2431 6.7170 12.1006 15.3679
frequency: -20.9857 11.3271 15.3399 31.4418 39.2609 43.7474 61.1852 80.7341 93.9225 129.5359 138.0971 158.4097 173.9436 206.6296 222.2354 232.9257 241.0625 261.0171 293.4595 296.0057 313.3082 379.2542 382.9805 393.4415 407.2352 411.8196 431.5069 449.3011 469.8336 498.3146 511.8940 557.1348 581.3501 589.6180 621.6623 635.3324 652.8181 664.0513 701.6050 706.7733 776.6137 796.6932 803.8495 810.1498 827.6428 831.9098 850.0161 898.4487 920.8058 939.6776 962.2738 982.1281 982.3779 987.2753 989.6665 991.6720 995.2033 1028.4650 1049.7566 1054.6995 1065.0252 1068.8479 1098.7880 1120.8476 1179.9070 1186.3503 1218.0904 1232.0994 1249.0996 1277.4561 1298.4300 1299.8890 1355.0163 1362.5736 1381.3646 1391.9850 1401.1358 1402.8917 1414.9700 1453.9025 1470.9532 1474.0908 1475.6980 1563.0541 1588.7283 1595.1094 1596.2424 1676.7503 2981.9818 2982.5820 3053.5893 3064.1309 3093.1539 3136.9123 3139.4657 3147.4265 3163.6484 3166.7022 3173.6295 3178.6799 3195.7722 3514.9239
redmass: 1.0144 6.3046 9.1423 4.8430 4.9517 7.7639 7.3648 6.1575 7.9191 5.7715 5.3856 10.6582 7.0637 5.1404 7.2149 7.7331 4.9301 7.5790 4.1857 4.0674 4.6471 9.0500 3.7826 9.3708 2.9043 5.1514 7.3334 3.2800 2.1608 3.6919 4.3585 5.3970 3.9964 6.0403 6.9463 1.5464 5.7560 6.9019 2.2550 3.2656 5.1844 1.5596 6.3111 6.1788 1.5132 3.4836 1.2489 1.4528 1.5212 7.3531 1.3106 3.0624 1.6074 1.9370 1.9351 1.8292 2.7338 3.4272 1.5943 2.4748 1.8376 2.9959 1.8118 1.2891 1.0944 1.1363 3.0406 1.6022 1.8222 1.3866 1.2884 1.6472 1.6049 6.5790 5.7781 2.9620 1.2387 1.1218 2.5860 2.3417 1.0834 2.1968 1.1118 6.5441 6.6543 6.0280 6.9467 8.8544 1.0389 1.0619 1.0968 1.0953 1.0999 1.0895 1.0891 1.0885 1.0955 1.0967 1.0954 1.0933 1.0960 1.0642
irintensity: 0.5865 1.4451 0.7699 0.3621 0.7401 1.3200 0.3034 1.2446 2.8441 1.3629 2.3468 1.2038 0.1741 2.1928 2.0822 7.8488 13.9401 0.8768 3.8073 7.3316 2.2688 11.5778 0.9401 9.5298 1.4421 38.2374 66.1504 26.7661 21.4461 9.7750 84.9354 42.8576 22.6095 26.7307 0.4918 117.3683 40.5233 20.3620 31.1372 1.5225 8.9901 45.6624 56.8253 68.8165 53.6231 10.0009 1.6444 13.8799 6.4044 47.8124 0.7322 3.7929 2.6074 4.2221 23.7794 0.8714 9.6303 419.6655 20.0498 15.8013 15.8082 27.5964 12.3620 7.8236 1.5502 10.4500 6.3749 1.7356 30.2106 8.2595 2.3973 0.4826 15.4508 3.1306 0.6653 11.2879 18.0133 34.6980 32.6879 67.0750 15.4376 22.8527 15.4448 41.9438 23.2993 10.1707 0.1286 149.7608 25.8227 16.8889 2.2755 15.7407 14.7803 10.9761 8.3604 8.2278 0.8986 8.2853 5.3358 0.2376 4.6783 28.9863
temp: 298.150 k
press: 1.00000 atm
elementType: 17 16 8 8 8 8 7 6 6 6 6 6 6 6 6 6 6 6 6 6 6 6 1 1 1 1 1 1 1 1 1 1 1 1 1 1
symmnumber: 1
zpe: 678645.9 jmol-1
zpe.correction: 0.258483 hartree
zpe.thermalcorrener: 0.279899 hartree
zpe.thermalcorrenthalpy: 0.280843 hartree
zpe.thermalcorrgfe: 0.204159 hartree
zpe.sumelectzpe: -1792.000897 hartree
zpe.sumelectthermal: -1791.979481 hartree
zpe.sumelectthermalent: -1791.978537 hartree
zpe.sumelectthermalfe: -1792.055220 hartree
dipole: 2.6112 2.5018 -2.0017
dipole: 4.1333
quadrupole: -109.8838 -158.2935 -141.5582
quadrupole: -2.6893 1.1200 15.1620
quadrupole: 26.6947 -21.7150 -4.9797 -2.6893 1.1200 15.1620
hfenergy: -1792.2593794 hartree
pointgroup: C01 [X(C15H14Cl1N1O4S1)]
dipole: -1.1653827 -0.5654425 -0.9831389 debye
polarizability: 248.6416761|8.8254315|224.5314962|20.9991692|-7.3137934|177.256787 unknown
InChI: InChI=1S/C15H14ClNO4S/c1-11-5-7-14(8-6-11)22(20,21)17(10-15(18)19)13-4-2-3-12(16)9-13/h2-9,18H,10H2,1H3
charge 0 multiplicity 1
36 atoms
Cl -0.853858 -4.07777 -2.312367
S  0.422781 1.484576 0.825143
O  0.906776 2.991708 0.42915
O  0.676064 0.865792 2.30881
O  4.713314 1.171297 -1.414835
O  3.905027 0.489658 0.656393
N  1.168632 0.406804 -0.576483
C  -1.411931 1.307213 0.452776
C  1.078087 -1.013358 -0.361405
C  2.332113 1.031813 -1.207094
C  -2.148399 0.377025 1.202672
C  -1.97395 2.128976 -0.536137
C  -4.150595 1.06335 -0.066641
C  0.275202 -1.743717 -1.279658
C  1.71195 -1.67938 0.72303
C  -3.528313 0.261293 0.926905
C  -3.357243 1.995853 -0.787644
C  3.68871 0.841833 -0.519545
C  0.15651 -3.134055 -1.117435
C  1.5500 -3.074613 0.866436
C  -5.640715 0.946917 -0.328884
C  0.778638 -3.820027 -0.055659
H  2.146687 2.1244 -1.255752
H  2.408042 0.668876 -2.248076
H  -1.660839 -0.219603 1.98013
H  -1.358412 2.85619 -1.074864
H  -0.232613 -1.213678 -2.08965
H  2.314198 -1.102725 1.428593
H  -4.128348 -0.46063 1.492519
H  -3.825789 2.625573 -1.552363
H  2.032311 -3.593252 1.701494
H  -5.912257 1.347937 -1.320158
H  -5.979469 -0.102805 -0.278138
H  -6.217617 1.513465 0.427302
H  0.661566 -4.90243 0.050267
H  5.593838 1.108395 -0.954434
