program: Gaussian 09
title: 000001079
version: EM64L-G09RevD.01
frameworkgroup: C1[X(C15H23N6O5S)]
method: RPBEPBE
basis: SDD
operation: Freq
keyword: #p
keyword: freq=noraman
keyword: PBEPBE/SDD
title: #p freq=noraman PBEPBE/SDD
converged: YES YES NO NO
title: Mulliken charges:
elementType: S O O O O O N N N N N N C C C C C C C C C C C C C C C H H H H H H H H H H H H H H H H H H H H H H H
charge: 0.442612 -0.272459 -0.445977 -0.439668 -0.426318 -0.199284 -0.179888 -0.056470 -0.122911 -0.575641 -0.038684 -0.594456 -0.019218 -0.168917 -0.167325 -0.070708 -0.694657 -0.637031 0.211957 -0.232080 -0.372250 -0.769405 -0.097762 -0.198178 0.174164 0.159034 -0.356368 0.282211 0.286607 0.272074 0.272718 0.318743 0.395104 0.359261 0.338727 0.373726 0.370019 0.276063 0.238277 0.270368 0.291169 0.299824 0.296567 0.263375 0.304822 0.303785 0.232597 0.358506 0.350573 0.392771
chargesum: 1.00000
title: Mulliken charges with hydrogens summed into heavy atoms:
elementType: S O O O O O N N N N N N C C C C C C C C C C C C C C C
charge: 0.442612 -0.272459 -0.072251 -0.069649 -0.033547 -0.199284 -0.179888 -0.056470 -0.122911 0.032966 -0.038684 0.114623 0.262993 0.117690 0.104749 0.202010 0.019190 0.060957 0.211957 0.043983 0.136395 0.118156 -0.097762 0.065198 0.174164 0.159034 -0.123771
polarizability: 2.39596374e+02 9.00166312e+00 2.53231706e+02 -2.61532969e+01 1.33807175e+01 2.25438390e+02
1716.lowfreq: -0.0008 -0.0004 0.0015 2.2226 5.5614 8.2996 14.3343 15.6250 24.3715
frequency: 14.1655 15.4222 24.2930 29.8952 33.0356 47.7508 58.2067 70.8071 79.5632 100.5919 112.9824 130.0374 141.3996 154.3873 163.2402 174.8557 187.6073 191.0467 201.2060 211.1465 233.9566 241.8143 251.2845 259.0113 264.7192 277.5218 285.1892 297.5349 307.4607 317.8869 348.4496 372.8004 376.7637 402.4028 443.1223 487.3066 512.0372 515.3922 535.7437 558.9203 567.7705 576.9999 585.9883 598.9826 611.5311 623.3138 637.4641 639.2755 643.6516 645.8897 666.7336 692.6859 719.0145 740.5496 746.5440 766.7343 781.3665 786.3472 796.2289 810.2301 815.4909 861.2517 872.1914 919.2795 922.9575 945.6335 962.1602 969.4803 978.9128 988.9294 999.9804 1014.8901 1019.6059 1030.2784 1033.9964 1041.4406 1050.6020 1057.5666 1089.6382 1125.0491 1145.8289 1149.8498 1153.7667 1170.0200 1176.2728 1182.5525 1202.4591 1219.7718 1230.6355 1232.6987 1250.7671 1264.5927 1267.1284 1281.0601 1286.6934 1290.5812 1298.7799 1304.9602 1318.3146 1324.1204 1328.5801 1338.9089 1345.2242 1352.1882 1374.6972 1377.7302 1379.3935 1382.0517 1394.9420 1399.8718 1437.9443 1441.7553 1448.4131 1452.3788 1461.8721 1474.6055 1530.0225 1582.9958 1641.3812 1653.5338 1669.6492 2949.3936 2994.8129 3019.9108 3024.8412 3027.6238 3031.4222 3032.2282 3046.4250 3047.9304 3077.3521 3107.0243 3128.5543 3143.3738 3163.1072 3173.2357 3220.2087 3474.5729 3493.2854 3528.4834 3583.6069 3585.3989 3603.5048 3679.5191
redmass: 6.9242 6.7193 6.6685 5.3380 7.4454 5.1788 4.6000 5.9119 5.4132 5.9954 3.2026 4.1713 3.0091 2.4616 2.9093 2.5721 4.4375 2.0271 1.4217 5.2287 2.4844 3.2635 2.2289 3.8337 4.1237 5.9518 2.9476 2.5660 2.4447 1.5436 5.4217 4.9352 3.6165 3.3529 3.7185 3.7768 6.6463 6.3267 4.5152 3.3187 1.1363 3.6472 1.2900 6.5792 4.1142 1.6492 5.5859 1.8636 2.6490 3.7852 7.6136 7.1674 3.9821 1.7925 5.0895 3.6797 4.6637 3.1145 6.7676 1.6565 2.2348 8.7609 2.7051 2.6488 1.4378 2.2173 2.7379 2.3610 1.4394 1.5877 2.6214 3.8334 3.7519 2.2457 2.6314 3.5736 3.3305 2.3080 2.1098 1.8433 1.4334 3.0820 1.4516 2.2053 1.1830 1.4916 1.3746 2.8651 1.3812 1.4084 2.8420 1.1954 1.1974 1.3049 1.3353 1.3851 4.2371 1.3397 1.4091 1.3681 1.9583 2.5828 1.1465 1.6321 1.2634 1.4821 1.3334 1.7148 2.3769 1.2211 1.0661 3.0783 1.0710 1.0889 3.5012 1.0883 6.6156 1.8825 2.6862 1.1841 5.4205 1.0684 1.0635 1.0866 1.0868 1.0608 1.0301 1.0860 1.0883 1.0852 1.1010 1.1012 1.1055 1.0915 1.1066 1.1058 1.0984 1.0464 1.0642 1.0450 1.0673 1.0669 1.0979 1.1056
irintensity: 0.2689 1.2077 0.2608 1.4742 0.7825 1.6201 2.8867 1.5068 3.3419 0.9179 2.1713 0.0955 9.0292 2.4222 4.7149 0.4202 6.6912 4.0053 26.8677 10.4275 53.2304 28.2237 80.9111 1.1598 11.0531 17.7630 10.9297 47.2168 36.6073 92.7304 2.1828 7.2175 13.6873 11.7107 10.8098 7.8050 7.1464 5.6789 2.7519 6.6172 7.9778 51.9093 212.8046 5.4330 9.5392 77.8474 27.4768 231.3663 46.0161 68.8852 32.4813 8.6827 38.4667 5.4335 27.5623 21.0617 23.8710 22.7180 71.5903 2.4003 4.8079 13.3385 27.2397 18.6860 9.8757 7.5146 6.8201 13.1598 7.2355 51.3319 61.8255 9.0304 32.1084 97.9895 162.3744 92.0137 13.2025 5.2700 28.4137 31.9616 3.9672 32.2118 27.6498 97.8282 34.0112 16.4926 21.8794 37.8059 8.3203 9.3159 34.9271 8.3759 0.5715 4.5883 13.6057 8.5792 49.6155 2.0645 9.5094 29.7534 3.0476 63.9581 5.1302 63.2793 29.9837 1.9643 5.5278 11.5496 20.1770 31.4501 6.4440 40.8908 21.4007 50.2545 12.3491 7.7963 92.3506 35.6039 677.9000 114.7299 173.2212 206.8247 12.1631 22.6585 14.4139 35.5395 3.3784 1.9809 26.5611 7.4757 11.4928 16.3378 11.1560 18.9732 0.5488 0.3389 0.1914 16.9178 23.6528 186.6507 28.0663 31.0053 17.5815 61.0865
temp: 298.150 k
press: 1.00000 atm
elementType: 16 8 8 8 8 8 7 7 7 7 7 7 6 6 6 6 6 6 6 6 6 6 6 6 6 6 6 1 1 1 1 1 1 1 1 1 1 1 1 1 1 1 1 1 1 1 1 1 1 1
symmnumber: 1
zpe: 1029520.6 jmol-1
zpe.correction: 0.392124 hartree
zpe.thermalcorrener: 0.420476 hartree
zpe.thermalcorrenthalpy: 0.421420 hartree
zpe.thermalcorrgfe: 0.330191 hartree
zpe.sumelectzpe: -1685.759173 hartree
zpe.sumelectthermal: -1685.730820 hartree
zpe.sumelectthermalent: -1685.729876 hartree
zpe.sumelectthermalfe: -1685.821105 hartree
dipole: 1.5335 -4.3625 1.9203
dipole: 5.0071
quadrupole: -121.8239 -125.5570 -133.3128
quadrupole: -5.1869 -17.7673 -8.1229
quadrupole: 5.0740 1.3409 -6.4149 -5.1869 -17.7673 -8.1229
hfenergy: -1686.1512966 hartree
pointgroup: C01 [X(C15H23N6O5S1)]
dipole: 0.5155152 -1.8424775 0.469184 debye
polarizability: 247.361656|11.1533989|246.2205398|-20.9417481|20.273722|224.6842747 unknown
InChI: InChI=1S/C15H23N6O5S/c1-27(3-2-7(16)15(24)25)4-8-10(22)11(23)14(26-8)21-6-20-9-12(17)18-5-19-13(9)21/h5-8,10-11,14,22-24H,2-4,16-17H2,1H3
charge 1 multiplicity 1
50 atoms
S  -2.226909 -2.529338 0.629037
O  0.343447 -1.601928 -1.028598
O  2.25427 -2.477303 1.411779
O  2.701507 -3.1844 -2.16842
O  -2.770518 0.881294 -2.675986
O  -5.088991 0.803664 -2.869273
N  1.967788 0.17882 -0.640135
N  3.145761 2.135327 -0.344404
N  0.524279 0.320853 1.43786
N  -5.324034 1.733565 -0.157366
N  1.028991 2.337784 2.760113
N  2.654705 3.916111 2.096051
C  0.467131 -2.84894 -0.2079
C  1.978234 -3.038775 0.094159
C  2.656796 -2.245001 -1.05252
C  1.656834 -1.084056 -1.3580
C  -0.358795 -2.663731 1.059625
C  -2.396018 -0.719692 -0.045797
C  1.495856 0.740698 0.565312
C  2.946941 1.072198 -1.132616
C  -3.84025 -0.232964 0.091747
C  -2.894243 -2.355778 2.389314
C  2.247592 1.94279 0.716035
C  -4.075043 1.148062 -0.630221
C  1.98845 2.752861 1.86319
C  -4.073124 0.935826 -2.159035
C  0.370348 1.177935 2.498681
H  0.112975 -3.682207 -0.840905
H  2.272983 -4.101466 0.019463
H  3.657691 -1.866896 -0.768959
H  1.66273 -0.843978 -2.437561
H  -0.293239 -3.535852 1.729687
H  -0.079588 -1.71213 1.552369
H  -2.048376 -0.814701 -1.085227
H  -1.654554 -0.138541 0.529228
H  3.15199 -2.752471 1.723765
H  3.26734 -2.846205 -2.906371
H  3.467117 0.89337 -2.07254
H  -4.565083 -0.966186 -0.314601
H  -4.107014 -0.038213 1.14445
H  -2.704902 -3.313805 2.894334
H  -3.97446 -2.170471 2.319692
H  -2.37325 -1.528171 2.892277
H  -3.236195 1.819497 -0.374473
H  -6.162698 1.360378 -0.614605
H  -5.331516 2.754371 -0.099171
H  -0.384237 0.893117 3.240133
H  3.366436 4.237708 1.441324
H  2.434992 4.457355 2.931194
H  -2.800047 0.762213 -3.665439
