program: Gaussian 09
title: 000110734
version: EM64L-G09RevD.01
frameworkgroup: C1[X(C10H20O2)]
method: RPBEPBE
basis: SDD
operation: Freq
keyword: #pfreq=noraman
keyword: PBEPBE/SDD
title: #p freq=noraman PBEPBE/SDD
converged: YES YES NO NO
title: Mulliken charges:
elementType: O O C C C C C C C C C C H H H H H H H H H H H H H H H H H H H H
charge: -0.282171 -0.255079 0.040619 -0.435596 -0.399512 -0.347248 -0.366661 -0.353483 -0.694687 -0.696750 0.282645 -0.762800 0.225414 0.206569 0.201965 0.200560 0.223149 0.186196 0.213439 0.203716 0.202991 0.196714 0.191818 0.217498 0.211472 0.215803 0.210993 0.215561 0.210865 0.245528 0.246221 0.244249
chargesum: 0.00000
title: Mulliken charges with hydrogens summed into heavy atoms:
elementType: O O C C C C C C C C C C
charge: -0.282171 -0.255079 0.266034 -0.027062 0.024196 0.052387 0.040046 0.035049 -0.049914 -0.059330 0.282645 -0.026802
polarizability: 1.24753788e+02 -8.51731409e-01 1.24311871e+02 3.16311443e+00 -2.11647384e-01 9.78231318e+01
1716.lowfreq: -19.0052 -3.7433 -0.0006 -0.0005 0.0002 6.1809 42.2250 45.4357 48.9386
frequency: 42.1146 44.8458 48.5311 55.1121 58.1690 67.9763 76.9206 122.1785 144.8181 184.7317 198.2248 232.3891 234.3528 255.3670 269.9945 325.6598 381.3687 453.6726 469.5124 509.7459 571.3436 618.0480 723.4733 742.6610 756.3795 823.8278 854.1253 883.8804 901.5460 906.2631 937.5491 975.9512 996.7854 1025.3800 1041.4322 1041.6803 1060.0352 1077.2302 1088.1531 1114.7864 1136.8472 1169.5585 1204.5940 1211.8951 1229.9053 1257.1498 1269.0030 1284.2647 1289.9327 1290.2760 1317.7711 1326.7899 1350.0257 1354.6867 1363.5178 1382.1687 1391.2207 1391.4153 1450.2017 1453.2877 1455.9217 1464.3292 1467.0529 1473.9432 1476.6300 1477.3608 1477.7846 1486.8580 1487.5407 1640.5242 2960.5059 2967.0490 2970.9848 2972.8472 2974.8097 2978.1029 2982.6796 3002.7708 3004.6009 3005.5080 3016.0928 3025.9994 3048.6136 3051.2575 3069.6930 3071.9733 3072.5513 3075.5252 3096.9874 3138.8380
redmass: 3.7277 1.7302 1.8307 1.7744 2.3571 1.9193 2.4801 2.4960 2.3877 2.8836 3.3935 1.1669 1.1491 2.8091 3.0956 3.8592 2.9105 3.4669 2.8280 2.7997 3.1832 4.6965 1.1858 1.1414 1.5045 1.6602 1.4938 1.9596 1.8518 3.5945 1.3855 1.9253 1.8123 3.8467 2.2744 1.6593 1.6006 2.2869 1.9545 2.1186 2.4867 2.1295 2.5867 1.7202 1.3509 1.3087 1.2366 1.1671 1.1286 1.0934 1.3108 1.2948 1.5323 1.4713 1.7166 1.2504 1.2146 1.2179 1.0801 1.0622 1.0521 1.0789 1.0686 1.0619 1.0668 1.0427 1.0427 1.0767 1.0816 9.3362 1.0595 1.0616 1.0570 1.0362 1.0387 1.0603 1.0603 1.0917 1.0392 1.0876 1.0998 1.0992 1.1031 1.1024 1.1007 1.0993 1.1008 1.0997 1.0950 1.1019
irintensity: 1.2666 1.3110 0.0475 0.0854 0.0923 0.5162 2.2836 0.0465 0.0625 3.7066 4.9438 0.1840 0.3135 0.6906 0.1933 3.8923 2.7507 8.9859 0.2893 1.0966 4.2921 5.7759 5.0058 6.1451 9.7487 2.4139 2.6626 11.9404 0.4165 48.4163 18.4117 27.0661 68.5078 4.3613 3.4268 9.1608 18.6021 1.5743 3.1407 23.7657 10.6298 9.9766 261.5617 77.5479 2.3566 5.4783 5.7468 0.9554 0.1042 0.4834 0.3378 0.4308 4.2574 2.5170 2.4652 53.9749 0.5761 22.5544 4.2778 22.9151 17.2710 2.1871 0.1902 2.8490 3.5481 12.9817 12.8460 14.8368 13.9096 182.6070 5.1529 29.7548 30.3492 42.6281 20.9962 53.1220 34.0409 1.9251 2.0670 24.7373 3.7079 1.4354 25.7399 40.4783 90.7258 50.1131 79.9614 58.4408 9.8523 10.5234
temp: 298.150 k
press: 1.00000 atm
elementType: 8 8 6 6 6 6 6 6 6 6 6 6 1 1 1 1 1 1 1 1 1 1 1 1 1 1 1 1 1 1 1 1
symmnumber: 1
zpe: 740704.1 jmol-1
zpe.correction: 0.282119 hartree
zpe.thermalcorrener: 0.298131 hartree
zpe.thermalcorrenthalpy: 0.299075 hartree
zpe.thermalcorrgfe: 0.236552 hartree
zpe.sumelectzpe: -542.526562 hartree
zpe.sumelectthermal: -542.510551 hartree
zpe.sumelectthermalent: -542.509606 hartree
zpe.sumelectthermalfe: -542.572129 hartree
dipole: -0.8607 -0.9060 -1.5919
dipole: 2.0238
quadrupole: -77.5963 -71.1128 -78.9188
quadrupole: -2.5041 -3.8051 -5.4496
quadrupole: -1.7203 4.7631 -3.0428 -2.5041 -3.8051 -5.4496
hfenergy: -542.8086811 hartree
pointgroup: C01 [X(C10H20O2)]
dipole: -0.4052062 0.3113562 0.6105915 debye
polarizability: 124.4829712|0.769468|124.5353006|-2.8431814|-1.8471361|97.8705185 unknown
InChI: InChI=1S/C10H20O2/c1-4-6-8-10(7-5-2)12-9(3)11/h10H,4-8H2,1-3H3
charge 0 multiplicity 1
32 atoms
O  0.496215 -1.056145 0.622898
O  1.895638 -1.808877 -1.090415
C  0.381375 0.296583 -0.041301
C  -0.996494 0.835983 0.36742
C  1.579312 1.153907 0.411279
C  -2.177795 -0.008125 -0.159062
C  1.677272 2.51277 -0.323667
C  -3.553208 0.55711 0.261683
C  2.950618 3.292868 0.068296
C  -4.73361 -0.290454 -0.259812
C  1.301387 -2.008723 -0.004764
C  1.35813 -3.278892 0.818747
H  0.437241 0.126598 -1.135055
H  -1.040801 0.897435 1.4734
H  -1.08719 1.871947 -0.015594
H  1.515711 1.320529 1.505199
H  2.507632 0.58263 0.218437
H  -2.128008 -0.063146 -1.266865
H  -2.075516 -1.045884 0.213639
H  1.675962 2.336124 -1.418537
H  0.785875 3.1314 -0.101271
H  -3.59915 0.615724 1.368452
H  -3.652296 1.598287 -0.108984
H  3.007238 4.262234 -0.459682
H  2.972657 3.497268 1.155337
H  3.860012 2.71594 -0.183522
H  -4.675751 -1.32699 0.122711
H  -5.706111 0.131869 0.053443
H  -4.727194 -0.341163 -1.365074
H  0.375515 -3.501903 1.264364
H  2.079263 -3.149128 1.646455
H  1.693971 -4.115274 0.187947
