program: Gaussian 09
title: 000110733
version: EM64L-G09RevD.01
frameworkgroup: C1[X(C8H17N)]
method: RPBEPBE
basis: SDD
operation: Freq
keyword: #pfreq=noraman
keyword: PBEPBE/SDD
title: #p freq=noraman PBEPBE/SDD
converged: YES YES NO NO
title: Mulliken charges:
elementType: N C C C C C C C C H H H H H H H H H H H H H H H H H
charge: -0.561491 0.021250 -0.428489 -0.463767 -0.403766 -0.405890 -0.141209 -0.381215 -0.730931 0.173612 0.174172 0.245370 0.210348 0.189346 0.194838 0.187406 0.188898 0.193886 0.206942 0.195856 0.186512 0.206491 0.204868 0.224141 0.263742 0.249079
chargesum: 0.00000
title: Mulliken charges with hydrogens summed into heavy atoms:
elementType: N C C C C C C C C
charge: -0.048669 0.194862 -0.008947 -0.064073 -0.021522 -0.023106 0.065733 0.001153 -0.095432
polarizability: 1.03714721e+02 1.37944615e-01 9.05401868e+01 5.35285698e-01 -4.91163220e-01 7.79410953e+01
1716.lowfreq: -25.3495 -11.5491 -4.2584 -0.0008 -0.0008 -0.0007 70.0859 107.1851 186.9196
frequency: 70.0261 107.1813 186.9081 219.8816 224.3432 251.2280 296.0457 321.0956 389.5449 408.4588 426.9287 434.2852 487.1944 521.1110 667.6945 774.2685 785.4800 832.2530 859.7312 879.2465 890.8283 913.2951 940.2638 975.9273 1016.6185 1046.5674 1056.3539 1058.6453 1081.2714 1107.3162 1115.1845 1148.6471 1182.0304 1192.4559 1251.6696 1252.0992 1258.2705 1284.7573 1303.9091 1315.5123 1326.9082 1331.8716 1337.4644 1339.1007 1351.8118 1361.5595 1378.8052 1458.6239 1460.6860 1463.1430 1467.4752 1469.1675 1476.1387 1480.0001 1633.5071 2907.9521 2950.2550 2955.3833 2959.8228 2960.3823 2961.4509 2963.6091 2972.1339 3020.8272 3021.3803 3029.5941 3036.3791 3057.6308 3058.8425 3064.2995 3413.1369 3539.6546
redmass: 2.8467 2.4581 2.7202 1.7368 1.1667 1.1738 1.7295 2.6639 1.9482 2.6025 2.8327 2.4142 2.4038 1.5211 1.5396 2.0737 1.4655 2.7819 1.5056 2.1323 1.4948 1.8856 1.9328 1.4619 1.5581 1.3706 1.5856 1.8500 1.5931 2.1090 2.1424 1.9156 1.8735 1.6055 1.2752 1.3832 1.2944 1.2898 1.3037 1.2607 1.4586 1.4247 1.5579 1.4736 1.3462 1.5191 1.2153 1.0822 1.0878 1.0839 1.0713 1.0784 1.0675 1.0761 1.0919 1.0803 1.0675 1.0668 1.0608 1.0609 1.0366 1.0645 1.0831 1.0984 1.0954 1.0985 1.1018 1.0943 1.0994 1.0986 1.0447 1.0959
irintensity: 0.2631 0.6353 1.2598 2.4221 40.5563 10.7064 4.6239 1.9742 1.4480 2.3975 2.1449 15.6121 2.9708 3.4625 192.0342 0.7438 0.1438 8.3116 3.1508 1.6357 10.4499 0.1441 1.1787 8.9395 4.9935 1.9562 2.5629 4.0852 1.3411 2.4638 1.9936 22.9646 0.5524 3.0243 1.5690 5.5785 4.7397 0.3859 0.6993 6.0161 0.2189 0.2404 0.5891 0.6830 11.3404 0.9156 17.5706 3.5045 7.0465 9.6485 9.0045 13.2512 11.3364 2.2165 38.3044 15.3569 17.7150 15.9558 35.3098 50.9627 28.9899 33.3367 62.0224 75.2507 81.6475 14.8170 119.5665 28.7804 59.5415 52.2655 4.3014 0.4573
temp: 298.150 k
press: 1.00000 atm
elementType: 7 6 6 6 6 6 6 6 6 1 1 1 1 1 1 1 1 1 1 1 1 1 1 1 1 1
symmnumber: 1
zpe: 626505.4 jmol-1
zpe.correction: 0.238623 hartree
zpe.thermalcorrener: 0.248651 hartree
zpe.thermalcorrenthalpy: 0.249595 hartree
zpe.thermalcorrgfe: 0.204155 hartree
zpe.sumelectzpe: -369.043213 hartree
zpe.sumelectthermal: -369.033185 hartree
zpe.sumelectthermalent: -369.032241 hartree
zpe.sumelectthermalfe: -369.077681 hartree
dipole: -0.9978 0.7978 0.3850
dipole: 1.3343
quadrupole: -53.9874 -61.8649 -56.1345
quadrupole: 0.3905 -0.7974 -0.9032
quadrupole: 3.3415 -4.5359 1.1944 0.3905 -0.7974 -0.9032
hfenergy: -369.2818363 hartree
pointgroup: C01[X(C8H17N1)]
dipole: -0.3865883 -0.3210871 -0.1517232 debye
dipolederiv: -0.4671135 -0.0065759 -0.0910111 -0.0133396 -0.840608 0.0338991 -0.0555467 0.0012892 -0.1812227 -0.0234324 -0.0014422 0.0181712 -0.0441918 0.0084152 0.0042422 0.0638109 -0.0189188 0.1647975 -0.0587166 -0.0272761 0.0021993 0.0399771 0.0131187 -0.013072 0.0039704 0.0214635 0.1528902 -0.028542 0.0205386 0.0138636 0.0052014 0.0458237 0.0161474 0.0316464 -0.0246838 0.1523177 0.0470399 0.0146659 0.0134345 -0.0075 0.0727603 0.0145183 -0.0192096 -0.0155552 0.1573186 0.0594519 -0.0222957 0.0091891 -0.0037985 0.0706544 -0.0231059 -0.0233838 0.0068705 0.1556564 0.4020232 -0.0954958 0.0887043 -0.0180618 0.5111544 -0.034559 0.049928 -0.0720718 0.244819 0.0635436 0.00078 -0.0235908 0.0060209 0.024323 -0.0013434 0.0187612 -0.0003902 0.1538624 -0.0929729 -0.1356036 -0.030528 -0.056859 -0.1684138 -0.0007459 -0.0115573 -0.0206548 0.0819617 0.0308133 0.005349 -0.0171501 0.0027816 0.0182451 0.0023885 -0.0305074 0.0072263 -0.2143327 0.0329002 -0.0239347 0.0116974 -0.0278958 0.0657586 0.0429188 0.0151987 -0.0239575 -0.1982631 0.0708632 0.1014473 -0.0109677 0.0825443 -0.092188 0.029273 -0.0116005 0.0532873 0.0615932 -0.0071272 -0.1171382 -0.0338883 -0.1192567 -0.1390676 -0.0495315 -0.050371 -0.0677895 0.0377019 0.0398305 0.0183275 0.0196721 0.0232159 0.0573342 -0.0141724 0.025215 0.0521911 -0.1877061 -0.0548589 -0.1186094 -0.0305744 -0.1236659 -0.1599102 -0.0540105 -0.0520388 -0.0859151 0.0517584 0.0343245 0.0271389 -0.0155704 0.0327943 0.0593047 -0.005804 0.0317825 0.0582645 -0.2056821 0.0305538 -0.0265705 -0.0197385 -0.0335658 0.0636547 0.0198785 0.0278465 -0.0431618 -0.2027679 -0.0519814 0.1122469 -0.0225668 0.1238363 -0.1693358 0.0421408 -0.0431198 0.0746565 0.0586789 0.0372627 0.0035266 -0.0355864 0.0118729 -0.0085865 -0.0306869 -0.0046871 -0.0128235 -0.1873328 -0.2470451 -0.0004289 0.0649212 -0.0008878 0.0397912 -0.0016126 0.1054521 -0.0017596 0.0500801 0.0836456 -0.0011246 0.0099345 0.0009471 0.0166668 0.0065294 -0.0669234 0.0067699 -0.2034978 -0.221149 -0.0132716 0.0565971 0.0407508 0.0674687 -0.0206416 0.0685739 -0.0113679 0.0673945 0.0904917 0.001374 0.0439007 -0.0129257 0.0539206 -0.0092491 -0.0107182 -0.0690104 -0.1642738 0.0883111 0.0945683 -0.0584953 0.0715588 -0.1355655 0.0861938 -0.0563664 0.0985691 0.0197807 -0.0732769 0.1061002 0.0609748 -0.0314938 0.2890041 0.066089 0.0291566 0.0819153 0.1614007 0.2151606 0.0837041 -0.0235923 0.051941 0.2362772 -0.1056841 -0.0353123 0.0055568 -0.0269331 unknown
polarizability: 103.7258272|0.026811|90.5197142|-0.173594|-0.6980885|77.9504619 unknown
InChI: InChI=1S/C8H17N/c1-7(9)8-5-3-2-4-6-8/h7-8H,2-6,9H2,1H3
charge 0 multiplicity 1
26 atoms
N  -2.48152 1.242256 -0.284275
C  -0.342396 -0.000741 -0.214697
C  0.427548 1.24958 0.285982
C  0.416106 -1.287983 0.202038
C  1.89088 1.272533 -0.212174
C  1.887494 -1.272916 -0.282683
C  -1.822473 0.027036 0.269763
C  2.643077 -0.013822 0.202732
C  -2.601397 -1.275529 -0.060318
H  -0.359723 0.030979 -1.33053
H  0.425006 1.239917 1.39772
H  -0.119103 2.157583 -0.023771
H  -0.089276 -2.186454 -0.199939
H  0.395944 -1.374822 1.30993
H  2.412238 2.166758 0.182254
H  1.901535 1.35976 -1.319241
H  1.901055 -1.295214 -1.392822
H  2.406601 -2.189471 0.060494
H  -1.809378 0.152046 1.373078
H  3.675076 -0.008082 -0.199869
H  2.729041 -0.04333 1.309103
H  -3.664667 -1.165144 0.226015
H  -2.562021 -1.491099 -1.146418
H  -2.201011 -2.154248 0.477765
H  -3.41326 1.412324 0.113258
H  -2.524676 1.223882 -1.312097
