program: Gaussian 09
title: 000110729
version: EM64L-G09RevD.01
frameworkgroup: C1[X(C10H10O3)]
method: RPBEPBE
basis: SDD
operation: Freq
keyword: #pfreq=noraman
keyword: PBEPBE/SDD
title: #p freq=noraman PBEPBE/SDD
converged: YES YES NO NO
title: Mulliken charges:
elementType: O O O C C C C C C C C C C H H H H H H H H H H
charge: -0.256578 -0.226433 -0.153264 -0.400585 0.501134 -0.347578 -0.421431 0.224982 -0.076804 -0.229709 -0.220989 -0.239569 -0.502577 0.269269 0.250969 0.229404 0.182561 0.228108 0.228028 0.230230 0.248218 0.244468 0.238146
chargesum: 0.00000
title: Mulliken charges with hydrogens summed into heavy atoms:
elementType: O O O C C C C C C C C C C
charge: -0.256578 -0.226433 -0.153264 -0.131317 0.501134 -0.096608 -0.192028 0.224982 0.105756 -0.001601 0.007038 -0.009339 0.228255
polarizability: 1.34991463e+02 9.99285838e+00 9.50682216e+01 -4.49776997e+00 1.11600768e+01 1.01378649e+02
1716.lowfreq: -10.7747 -3.3844 -2.3627 -0.0012 -0.0006 0.0003 25.9460 28.8612 47.1241
frequency: 25.8539 28.7758 47.0514 70.7880 84.7016 121.7616 162.2618 196.6777 237.1441 261.1168 314.5340 363.9166 401.9869 471.6232 504.0499 610.4778 642.2823 686.2084 695.6138 707.9062 754.2089 774.0102 850.3134 853.3128 921.8404 928.6197 972.6731 975.9979 991.1876 996.4531 1007.8318 1029.5427 1084.2640 1113.1514 1119.3045 1149.9243 1173.5694 1189.3387 1192.6842 1244.6355 1264.2075 1334.0436 1383.5913 1395.9840 1421.4858 1442.4753 1452.8789 1462.2903 1482.7261 1595.3496 1610.7659 1629.6154 1657.0387 2886.9832 2997.0375 3008.4691 3112.7509 3121.2901 3129.0297 3140.4142 3151.4295 3154.9615 3166.0610
redmass: 4.3880 4.3648 4.2043 1.5535 2.2297 5.3514 3.0012 4.6486 4.8423 4.0945 6.6529 5.8417 2.7913 4.6996 4.5849 5.8733 4.4321 5.2128 3.6628 1.7963 3.2901 2.5251 1.2607 4.4913 1.5961 2.3818 2.6651 1.6316 5.7824 1.3620 3.4226 2.1442 1.6222 1.2816 2.5206 1.4558 1.0628 1.5942 1.2150 2.1923 1.9143 1.2667 7.6049 1.2089 1.1851 2.1775 1.0498 1.0508 2.2689 6.1676 6.0965 8.7870 9.1465 1.0864 1.0811 1.0294 1.1049 1.0865 1.0871 1.0919 1.0965 1.1051 1.1017
irintensity: 1.1990 2.8820 3.9561 0.3495 0.3253 1.6047 4.9822 14.0093 1.3834 10.4341 6.2131 2.2562 0.0467 7.2623 18.8507 0.1989 6.5711 10.1084 4.8609 88.6811 15.0062 7.6823 0.1771 8.0548 2.7675 12.7673 16.5321 4.8646 2.6146 0.7013 10.3187 12.4061 6.5049 5.7941 217.1504 18.8514 0.7227 14.2925 1.3387 28.4738 160.5491 3.6114 1.1325 1.5446 21.6167 9.8117 16.1093 11.7921 17.7897 2.7698 13.2630 127.8987 146.4956 121.1763 8.6390 28.7602 23.0702 4.6800 0.5108 18.3697 28.7885 13.6292 17.6522
temp: 298.150 k
press: 1.00000 atm
elementType: 8 8 8 6 6 6 6 6 6 6 6 6 6 1 1 1 1 1 1 1 1 1 1
symmnumber: 1
zpe: 460313.9 jmol-1
zpe.correction: 0.175324 hartree
zpe.thermalcorrener: 0.188210 hartree
zpe.thermalcorrenthalpy: 0.189154 hartree
zpe.thermalcorrgfe: 0.133222 hartree
zpe.sumelectzpe: -611.765730 hartree
zpe.sumelectthermal: -611.752845 hartree
zpe.sumelectthermalent: -611.751901 hartree
zpe.sumelectthermalfe: -611.807833 hartree
dipole: 1.7019 -3.3646 -1.3808
dipole: 4.0154
quadrupole: -63.8090 -81.0421 -72.9499
quadrupole: 1.8747 -4.6544 -0.5872
quadrupole: 8.7913 -8.4418 -0.3495 1.8747 -4.6544 -0.5872
hfenergy: -611.9410547 hartree
pointgroup: C01 [X(C10H10O3)]
dipole: 0.4863075 -1.1748983 -0.9374524 debye
dipolederiv: -0.6902804 0.3938179 0.1722984 0.5656886 -0.848895 -0.3329089 0.2876827 -0.3950985 -0.69811 -0.5723122 0.0694217 -0.2178798 0.2448159 -0.4574424 -0.0050974 -0.0897125 -0.2471094 -0.7836757 -0.4924122 0.2368427 0.076343 0.0712294 -0.7902702 -0.1333543 0.0901238 -0.2042198 -0.3114102 -0.3053449 0.0742489 -0.0692663 0.0172565 -0.4025024 -0.1436649 -0.1084439 -0.3008052 0.029786 0.3123743 0.1149249 -0.0114492 0.2025405 -0.0877145 -0.0029885 -0.1153872 0.0043013 -0.0192011 -0.097994 0.0237258 0.0755023 0.061068 -0.0630214 0.0382093 0.0703878 0.0234185 -0.0185923 -0.1264845 0.014594 -0.0553541 0.0293398 -0.1283677 -0.025137 0.0223419 -0.0133185 0.0675046 0.896976 -0.5581103 0.0835624 -0.8390308 0.8331215 0.327976 -0.101257 0.6215369 1.1666055 0.7172461 -0.0104797 -0.0530176 0.022913 1.176986 0.2955149 -0.0586643 0.4791522 0.211031 -0.0533211 0.0219814 -0.0726037 0.0105019 -0.1370346 -0.0184068 -0.0647871 -0.0194013 0.1262096 -0.010548 0.0562744 0.0973931 0.0383362 -0.1133303 0.0379821 0.0946892 0.0348207 0.0368679 0.0546767 0.0945798 -0.0308843 0.084951 -0.1237933 -0.013824 -0.0288062 -0.0036157 -0.0476946 0.4611422 -0.1533111 -0.0752783 -0.1960552 0.4582313 0.0691041 -0.0040876 -0.0160521 0.2140003 0.096818 -0.0156559 -0.0153444 0.0049775 0.0490765 -0.0020471 0.0452093 0.055703 -0.028319 0.0378982 -0.0437682 -0.0811613 -0.0374455 0.1154376 -0.0305636 -0.0809218 -0.024016 0.0304824 0.0701553 -0.0332662 0.0869324 -0.0258451 0.1292671 0.0324403 0.0607819 0.0268546 -0.0772493 -0.2698065 -0.1210131 0.0153985 -0.0752452 -0.0135893 -0.0185577 -0.0042797 -0.0519693 0.0846241 0.0631054 -0.0343481 0.0532106 -0.0371646 0.1405808 0.0211458 0.0704825 0.0257129 -0.0977704 0.0008189 -0.0582742 -0.0924364 -0.0687785 0.1332869 -0.0362953 -0.104395 -0.0398202 -0.0314726 -0.0901398 -0.0964108 0.0401258 -0.09475 0.1201435 0.0158013 0.041852 0.0169362 0.0814891 0.0039528 -0.0194056 0.0827806 0.0230028 -0.0167172 0.0408073 0.0254819 0.1310492 0.0131185 -0.0930668 0.0047868 -0.016397 -0.0638408 -0.0077993 -0.0401602 -0.0954482 0.0034519 0.0961372 0.0865466 0.0388451 0.0075252 0.0615346 0.0343465 -0.0759755 0.0471576 -0.1075113 -0.0443611 unknown
polarizability: 136.0694788|7.5679632|88.1182|-3.6507327|7.2088218|107.2506542 unknown
InChI: InChI=1S/C10H10O3/c1-13-10(12)9(7-11)8-5-3-2-4-6-8/h2-7,9H,1H3
charge 0 multiplicity 1
23 atoms
O  2.194726 -1.104302 -1.036948
O  2.297113 -0.300377 1.149917
O  0.14377 2.906921 0.536282
C  0.724005 0.716039 -0.468071
C  -0.665824 0.160003 -0.153175
C  -1.08131 -0.012137 1.191324
C  -1.547004 -0.192331 -1.203153
C  1.812931 -0.254402 -0.004308
C  1.013828 2.108131 0.138108
C  -2.362713 -0.529887 1.476824
C  -2.830583 -0.710141 -0.916853
C  -3.241413 -0.88041 0.424743
C  3.190806 -2.147897 -0.678257
H  0.82724 0.828441 -1.566565
H  -0.404338 0.256676 2.010047
H  -1.231702 -0.062008 -2.245566
H  2.100912 2.375765 0.158156
H  -2.677966 -0.656712 2.518428
H  -3.506178 -0.976936 -1.737127
H  -4.236805 -1.279923 0.648988
H  2.7833 -2.801974 0.110295
H  4.120983 -1.677306 -0.318801
H  3.358724 -2.704433 -1.610286
