program: Gaussian 09
title: 000110726
version: EM64L-G09RevD.01
frameworkgroup: C1[X(C7H12O2)]
method: RPBEPBE
basis: SDD
operation: Freq
keyword: #pfreq=noraman
keyword: PBEPBE/SDD
title: #p freq=noraman PBEPBE/SDD
converged: YES YES NO NO
title: Mulliken charges:
elementType: O O C C C C C C C H H H H H H H H H H H H
charge: -0.449761 -0.441034 -0.149079 -0.188697 -0.514629 -0.110352 -0.096489 -0.523007 -0.494526 0.259048 0.259406 0.204581 0.258418 0.202677 0.231904 0.241843 0.211440 0.217460 0.227961 0.331553 0.321283
chargesum: 0.00000
title: Mulliken charges with hydrogens summed into heavy atoms:
elementType: O O C C C C C C C
charge: -0.118208 -0.119751 0.109969 0.070709 -0.051630 0.092325 0.135414 -0.063704 -0.055125
polarizability: 8.39829945e+01 -2.52983168e+00 7.02712438e+01 1.44367798e+00 -1.55646507e+00 7.07586139e+01
1716.lowfreq: -28.1395 -6.1317 0.0003 0.0005 0.0005 21.6009 97.5673 190.2005 266.6329
frequency: 97.4346 190.1669 266.6284 281.6341 290.6434 322.4131 365.6984 420.5621 439.2327 531.1937 619.1906 729.1762 769.4680 796.0293 825.1478 867.2081 886.6925 918.2769 923.8399 940.0783 946.5313 979.4891 997.3071 1030.3664 1044.9438 1051.9666 1100.3000 1111.0137 1140.1314 1150.4273 1178.7858 1205.5420 1230.6399 1248.6874 1261.8887 1265.2929 1285.1428 1293.8113 1297.6694 1314.7888 1371.9619 1376.2160 1452.0869 1463.6074 1480.8091 2972.1916 3000.0029 3002.4966 3006.5465 3056.8144 3064.0653 3074.9507 3081.0930 3088.8270 3095.4329 3549.1589 3558.5945
redmass: 3.8869 3.3822 1.4712 1.1219 2.5389 2.0360 5.9037 2.5445 1.8340 2.3512 3.2886 4.1832 4.9578 2.6249 2.7162 2.2864 1.7996 2.5572 2.6479 2.1777 2.0640 1.6162 2.9182 1.6071 1.9589 1.8492 1.1218 1.2441 1.1494 1.4406 1.4815 1.7720 1.5757 1.4645 1.3456 1.3601 1.5667 1.4267 1.5471 1.6580 1.3194 1.2944 1.0895 1.0834 1.0992 1.0847 1.0626 1.0631 1.0613 1.0943 1.1042 1.0965 1.0904 1.0982 1.0935 1.0656 1.0662
irintensity: 5.3327 2.3165 55.3278 84.3243 26.0799 120.0336 2.6040 0.4579 4.5382 2.9830 5.6479 13.0193 4.8116 6.8602 4.5912 25.3824 8.7251 8.3451 12.9631 16.9617 6.5693 48.7811 16.7358 19.8091 4.4611 115.3922 0.8848 0.3044 7.1940 18.6375 2.8728 2.2007 9.4760 24.0965 5.2444 11.6312 0.2177 3.6724 13.6105 2.1403 8.5575 28.5515 15.1653 14.8482 9.5369 55.9067 83.5191 11.4404 27.0374 5.2116 16.0850 68.4995 44.9851 29.8525 7.4867 4.1951 2.3888
temp: 298.150 k
press: 1.00000 atm
elementType: 8 8 6 6 6 6 6 6 6 1 1 1 1 1 1 1 1 1 1 1 1
symmnumber: 1
zpe: 474380.9 jmol-1
zpe.correction: 0.180682 hartree
zpe.thermalcorrener: 0.188900 hartree
zpe.thermalcorrenthalpy: 0.189845 hartree
zpe.thermalcorrgfe: 0.148375 hartree
zpe.sumelectzpe: -423.646296 hartree
zpe.sumelectthermal: -423.638078 hartree
zpe.sumelectthermalent: -423.637134 hartree
zpe.sumelectthermalfe: -423.678604 hartree
dipole: -1.5430 0.4439 -0.5467
dipole: 1.6961
quadrupole: -62.9670 -53.6783 -51.9275
quadrupole: -6.5183 7.3787 -0.7384
quadrupole: -6.7761 2.5126 4.2635 -6.5183 7.3787 -0.7384
hfenergy: -423.8269782 hartree
pointgroup: C01 [X(C7H12O2)]
dipole: -0.6022618 0.173298 -0.2291575 debye
dipolederiv: -0.8790367 -0.1250093 0.1369113 -0.124639 -0.4191188 -0.1957946 0.2086047 -0.1660433 -0.3187533 -0.8638736 0.0463986 -0.1704434 0.0981427 -0.522123 -0.1274329 -0.2518931 -0.1512611 -0.2641438 0.0160919 0.0279253 -0.0257416 0.0528201 0.0792888 -0.0315398 -0.0584013 -0.0174966 0.0330027 -0.0394287 0.0404638 0.0037123 0.0686345 0.0584853 0.0115555 0.0668949 0.0078095 0.0097454 0.0484324 -0.0456952 0.0162678 -0.0130399 -0.0263748 -0.0152157 0.0449027 -0.0183511 -0.0323068 0.7492176 0.0632533 -0.0763603 0.0118005 0.316013 0.0983881 -0.1033331 0.0787601 0.3222269 0.6871356 0.0289874 0.1167718 -0.0508499 0.3466434 0.0101253 0.158417 0.0298326 0.3326091 -0.0583715 -0.0587587 0.0072095 -0.1008141 -0.1103972 -0.0247924 0.011856 0.0117831 0.0722975 -0.106019 -0.0459342 -0.0465867 -0.0982675 -0.0835059 0.0041727 -0.014306 -0.0223082 0.0764166 0.0218534 -0.0839927 0.0287376 -0.0847671 -0.1012675 0.0480937 0.0310228 0.0574157 0.055087 0.0119064 -0.0831305 -0.0330674 -0.0829935 -0.1105313 -0.0561995 -0.031295 -0.0644065 0.0477497 -0.0842633 0.0663856 -0.166576 0.0669716 0.0251788 0.078847 -0.1195078 0.0534715 -0.0332525 -0.0111508 0.0553607 0.1297771 0.0539464 0.0455093 -0.0611175 0.081195 -0.0395468 0.0098801 -0.0544804 -0.0205446 -0.0045006 -0.0239135 -0.0162304 -0.0865987 -0.0113487 -0.0990902 -0.2066948 0.0029525 -0.0214642 0.0126892 -0.0237903 0.0167036 0.0742811 0.0321172 0.0732971 -0.1242365 -0.042302 0.1023925 -0.044135 0.0761166 -0.0322817 0.0314462 -0.0674046 0.0827479 0.0453586 0.042336 -0.047219 0.0491661 -0.0266135 0.0367369 0.0489963 0.0188389 0.1073513 -0.1527439 0.0498121 -0.0472405 -0.049888 -0.0218357 0.0453282 -0.0531094 -0.0171961 -0.1083087 -0.146284 -0.0614951 0.1094085 0.0365611 0.0881325 -0.0440096 -0.0223551 0.0520998 -0.079573 0.0540269 0.2459508 0.0970103 -0.0365385 0.1737177 0.2147132 0.1391534 -0.0894603 0.1465715 0.1744642 0.3247327 -0.058597 0.1160336 -0.0387586 0.2812396 0.1290963 0.0581969 0.1173452 0.0455509 unknown
polarizability: 83.88797|-2.5962169|70.2170827|1.6913253|-1.5871512|70.9077995 unknown
InChI: InChI=1S/C7H12O2/c8-6-2-4-1-5(6)3-7(4)9/h4-9H,1-3H2
charge 0 multiplicity 1
21 atoms
O  -2.773151 -0.137368 0.179476
O  2.83936 0.113027 0.10272
C  -0.507227 -1.02447 0.297586
C  0.491546 1.029389 0.312977
C  -0.034133 0.005458 1.364028
C  -1.485433 -0.164108 -0.539539
C  1.497133 0.164944 -0.503408
C  0.782501 -1.234641 -0.5512
C  -0.776018 1.238877 -0.572739
H  -0.975611 -1.949331 0.666255
H  0.93985 1.961077 0.691479
H  0.748565 -0.389759 2.039557
H  -0.867138 0.390793 1.97439
H  -1.632928 -0.583266 -1.556331
H  1.693574 0.588029 -1.502027
H  1.439002 -2.00057 -0.099481
H  -0.521127 1.57084 -1.595995
H  0.561514 -1.562596 -1.582853
H  -1.434842 1.998903 -0.113974
H  -3.40355 0.446251 -0.313988
H  2.756813 -0.243879 1.023969
