program: Gaussian 09
title: 000110725
version: EM64L-G09RevD.01
frameworkgroup: C1[X(C7H12O2)]
method: RPBEPBE
basis: SDD
operation: Freq
keyword: #pfreq=noraman
keyword: PBEPBE/SDD
title: #p freq=noraman PBEPBE/SDD
converged: YES YES NO NO
title: Mulliken charges:
elementType: O O C C C C C C C H H H H H H H H H H H H
charge: -0.456850 -0.456372 -0.256040 -0.155606 -0.129602 -0.093334 -0.492500 -0.465640 -0.441133 0.245025 0.246051 0.243884 0.202333 0.253669 0.209291 0.201572 0.237467 0.247547 0.196183 0.335273 0.328783
chargesum: 0.00000
title: Mulliken charges with hydrogens summed into heavy atoms:
elementType: O O C C C C C C C
charge: -0.121577 -0.127589 -0.011015 0.090445 0.114282 0.108999 -0.029540 -0.026601 0.002597
polarizability: 7.89650078e+01 -2.14616278e+00 7.46972518e+01 2.62520243e-01 2.55044690e+00 7.16119923e+01
1716.lowfreq: -15.0633 -0.0008 -0.0006 -0.0004 18.1166 23.1962 122.4866 209.2991 238.7800
frequency: 122.3730 209.2672 238.7687 264.5589 303.2886 314.6742 324.1159 402.9226 452.9107 536.7084 623.0212 736.1827 751.9160 814.2088 834.1506 850.0017 883.3294 907.9532 911.2692 942.3317 980.2026 1017.2609 1019.8198 1036.7335 1040.1365 1065.1885 1115.6048 1133.6552 1151.8367 1170.2620 1189.3232 1199.7640 1227.6917 1250.0546 1262.5803 1279.6738 1282.2817 1295.1071 1314.2269 1325.9096 1370.2240 1389.6411 1456.2423 1465.7185 1480.4221 2976.4379 3001.5348 3002.4045 3018.5364 3018.9410 3045.3289 3068.2644 3083.4669 3084.9165 3094.0408 3556.6119 3574.9340
redmass: 3.1466 3.3027 2.2658 1.1108 2.6852 3.4604 1.2615 2.7818 2.6437 4.7368 3.5394 4.1083 2.0945 2.7248 2.2099 2.0315 2.4051 2.4372 3.0619 2.0477 1.9496 1.8338 2.0559 2.5879 2.0711 1.9480 1.0865 1.2460 1.3053 1.6238 1.3299 1.2670 1.4724 1.5098 1.4823 1.3077 1.4942 1.3816 1.4732 1.5508 1.3906 1.4734 1.0826 1.0856 1.0978 1.0863 1.0626 1.0849 1.0617 1.0631 1.0895 1.1011 1.0994 1.0976 1.1016 1.0658 1.0663
irintensity: 0.7202 4.3497 0.0725 159.8874 17.5118 1.6640 129.1875 9.6074 12.6368 18.0280 2.4833 2.1547 1.2147 10.4179 15.3859 10.4931 5.6383 18.7528 0.6420 9.5089 50.8334 17.4389 14.0618 24.3948 23.0448 17.0211 27.7494 13.7824 10.6080 11.4685 6.3569 17.2628 39.4052 0.5283 13.9689 1.9849 13.7349 1.7329 3.3887 16.3260 2.2639 1.6794 4.3344 12.8960 11.9419 48.7081 43.2305 42.5093 25.5313 64.1411 46.4710 4.6733 24.0818 26.5649 54.4316 3.4882 3.4653
temp: 298.150 k
press: 1.00000 atm
elementType: 8 8 6 6 6 6 6 6 6 1 1 1 1 1 1 1 1 1 1 1 1
symmnumber: 1
zpe: 475329.8 jmol-1
zpe.correction: 0.181044 hartree
zpe.thermalcorrener: 0.189266 hartree
zpe.thermalcorrenthalpy: 0.190210 hartree
zpe.thermalcorrgfe: 0.148847 hartree
zpe.sumelectzpe: -423.645560 hartree
zpe.sumelectthermal: -423.637338 hartree
zpe.sumelectthermalent: -423.636393 hartree
zpe.sumelectthermalfe: -423.677756 hartree
dipole: -0.6680 0.5117 2.1025
dipole: 2.2646
quadrupole: -60.9761 -48.8384 -53.1041
quadrupole: 0.1702 -2.8670 3.3514
quadrupole: -6.6699 5.4678 1.2021 0.1702 -2.8670 3.3514
hfenergy: -423.8266033 hartree
pointgroup: C01 [X(C7H12O2)]
dipole: 0.2561328 -0.2176441 0.8251317 debye
dipolederiv: -0.7397124 -0.3931193 -0.0058445 -0.3222279 -0.3983036 -0.1549618 0.0178216 -0.1739815 -0.5019814 -0.9035734 0.1220744 0.0564149 0.150219 -0.5981523 -0.0924676 0.1123011 -0.1143375 -0.1535836 -0.2275583 -0.0636558 0.0022359 -0.1014482 -0.0216063 -0.0588479 -0.0078607 -0.1297184 -0.0447346 0.0733289 -0.0179857 0.0094798 -0.0538594 -0.0377184 0.0231942 0.0346232 0.0360143 0.1229233 0.5610612 0.2738394 -0.0089015 0.2824643 0.3917861 0.0678695 0.0098725 0.0625152 0.2937588 0.7025199 -0.1666828 0.0292266 -0.1571639 0.4553034 0.0375256 -0.0578746 0.0836793 0.2435151 -0.0120683 0.0241617 -0.0274382 0.0264541 0.0840056 0.035576 -0.0442692 0.0626292 -0.0445949 0.0357181 0.0910196 -0.0106612 0.0583225 0.0632204 0.0340429 0.0105614 0.0157127 0.0395607 0.0651142 0.0355721 0.0345145 0.048431 0.1060977 -0.0188627 0.0313353 -0.0030632 -0.0202916 0.0332804 0.052113 -0.0378265 0.0472057 -0.0778072 0.1345974 -0.0406713 0.1231232 -0.0538072 0.0182891 0.0204838 -0.07754 0.0144092 0.0744397 0.0188253 -0.0758868 0.022836 -0.1481 -0.0632853 0.0479933 0.0842106 0.058996 -0.0718542 -0.0860192 0.0677055 -0.0827259 -0.0184327 -0.0675097 -0.0184347 -0.0557162 -0.0403146 -0.1047082 -0.108237 -0.061994 -0.1291242 -0.1014593 0.0000548 0.0288629 0.0774614 0.0540087 0.0619163 -0.0754701 0.0890597 -0.0290564 -0.031604 0.0486171 -0.0226768 -0.014935 -0.0620065 -0.1675955 0.0460632 -0.0215868 -0.0207574 0.0737059 0.0220041 -0.0795544 -0.113283 -0.0539885 -0.0440032 -0.1179258 -0.0616599 -0.0797326 -0.0548032 -0.0771016 -0.0381805 0.1219822 -0.0491279 0.0464088 0.0751428 0.0829361 0.0375699 -0.0181573 -0.1603384 0.0288566 -0.0240359 -0.0239574 0.0871879 0.0056519 -0.0112245 0.0187779 0.054484 0.0697059 -0.0686844 0.0002065 -0.0003758 -0.199263 0.0255337 -0.004875 0.0116469 0.0445755 0.2607918 0.1059174 -0.025803 0.0420644 0.087628 0.1199711 0.0119511 0.174177 0.3003319 0.360662 0.0380802 -0.0137472 0.081895 0.263018 0.0887985 -0.0802648 0.1138158 0.0186948 unknown
polarizability: 78.8979825|-2.1981682|74.8412034|-0.3052177|-2.5075393|71.535066 unknown
InChI: InChI=1S/C7H12O2/c8-6-3-4-1-2-5(6)7(4)9/h4-9H,1-3H2
charge 0 multiplicity 1
21 atoms
O  -1.885643 -1.431216 -0.327381
O  2.489089 -0.753078 0.016758
C  0.137358 -0.476446 0.904545
C  -0.54727 0.529586 -1.031024
C  -0.523106 -0.90345 -0.442137
C  1.431826 0.212832 0.385329
C  0.960599 0.9030 -0.937054
C  -0.828743 0.642574 1.401245
C  -1.325836 1.313143 0.066325
H  0.326574 -1.279302 1.638808
H  -0.973421 0.613861 -2.042356
H  0.124588 -1.592104 -1.020729
H  1.824519 0.930544 1.134688
H  1.545567 0.474853 -1.770227
H  1.120736 1.994504 -0.927903
H  -0.313026 1.354768 2.072235
H  -1.676611 0.208516 1.956534
H  -2.412058 1.171678 -0.056675
H  -1.107391 2.395339 0.022879
H  -1.846282 -2.344945 0.050261
H  2.82233 -1.19046 0.841379
