program: Gaussian 09
title: 000110722
version: EM64L-G09RevD.01
frameworkgroup: C1[X(C7H11NO3)]
method: RPBEPBE
basis: SDD
operation: Freq
keyword: #p
keyword: freq=noraman
keyword: PBEPBE/SDD
title: #p freq=noraman PBEPBE/SDD
converged: NO YES NO NO
title: Mulliken charges:
elementType: O O O N C C C C C C C H H H H H H H H H H H
charge: -0.211763 -0.166570 -0.183551 -0.420097 0.007104 -0.201631 -0.375837 -0.734413 0.164398 -0.703533 0.226994 0.228298 0.279486 0.192919 0.202984 0.215137 0.230764 0.242794 0.342192 0.223683 0.217504 0.223138
chargesum: 0.00000
title: Mulliken charges with hydrogens summed into heavy atoms:
elementType: O O O N C C C C C C C
charge: -0.211763 -0.166570 -0.183551 -0.077905 0.235402 0.077855 0.020067 -0.045718 0.164398 -0.039208 0.226994
polarizability: 1.05770086e+02 -7.21953304e+00 9.23715075e+01 6.49335905e+00 -1.27211000e+00 6.78543286e+01
1716.lowfreq: -7.8910 -6.3132 -0.0004 -0.0003 0.0000 11.2293 56.8899 66.9019 89.8678
frequency: 56.8426 66.8097 89.7344 130.8849 149.7606 199.0165 227.3424 245.1434 279.7719 305.9898 381.3119 402.1420 511.6212 522.8425 574.8370 611.8668 623.9307 685.6522 726.5307 775.0111 809.6178 820.7541 830.9950 920.3899 964.8644 997.2581 1022.6447 1040.2704 1071.9425 1114.4202 1134.4780 1174.1691 1203.4618 1243.5690 1264.5804 1273.9327 1309.7446 1337.2400 1354.5343 1380.1967 1396.1372 1402.9198 1465.3567 1475.2468 1479.4030 1486.4314 1494.1987 1716.2757 1793.6859 2953.5066 2981.1515 2984.2765 2988.1313 2989.0289 3010.9361 3078.1925 3079.6769 3084.5466 3094.9698 3606.6742
redmass: 3.0527 3.2680 2.4433 4.3385 11.9849 1.0408 1.3918 3.5039 3.0666 2.9188 9.4610 2.1898 4.6280 1.1510 9.9974 4.6192 5.1009 12.1191 4.7293 1.4148 6.0580 3.5765 3.3759 2.2451 1.1997 1.8368 1.8010 3.1106 3.1168 1.8554 2.1645 2.0435 3.7674 1.4668 1.3293 1.2970 1.4330 1.5023 1.4289 1.6232 1.2241 1.2034 1.0670 1.0438 1.0630 1.0536 1.0442 12.3615 11.4173 1.0594 1.0813 1.0387 1.0705 1.0512 1.0988 1.1000 1.0995 1.0999 1.0977 1.0797
irintensity: 1.4165 1.1495 0.9925 6.9849 0.1064 0.0136 0.4056 2.6172 0.2147 1.6743 6.2234 5.8049 4.0675 134.0714 24.6485 17.9604 6.9783 33.8940 32.2300 7.2787 122.3491 62.2727 5.4479 24.0226 13.4166 12.4050 3.7558 54.8501 48.9937 39.3954 27.1836 11.9611 109.4115 13.7590 8.8649 25.3551 21.4894 2.3567 12.7169 4.7384 10.8474 19.7635 0.1024 14.0634 8.1059 21.8979 9.9702 506.3494 379.1111 37.4966 13.2183 28.7960 2.0384 13.0687 41.2268 6.0030 56.7996 45.6780 27.0198 42.7893
temp: 298.150 k
press: 1.00000 atm
elementType: 8 8 8 7 6 6 6 6 6 6 6 1 1 1 1 1 1 1 1 1 1 1
symmnumber: 1
zpe: 462936.0 jmol-1
zpe.correction: 0.176323 hartree
zpe.thermalcorrener: 0.187769 hartree
zpe.thermalcorrenthalpy: 0.188713 hartree
zpe.thermalcorrgfe: 0.138663 hartree
zpe.sumelectzpe: -552.930615 hartree
zpe.sumelectthermal: -552.919169 hartree
zpe.sumelectthermalent: -552.918224 hartree
zpe.sumelectthermalfe: -552.968275 hartree
dipole: -6.0088 -2.0965 -1.8422
dipole: 6.6254
quadrupole: -78.1748 -74.5728 -62.5867
quadrupole: 2.4408 -2.7096 2.1518
quadrupole: -6.3967 -2.7947 9.1914 2.4408 -2.7096 2.1518
hfenergy: -553.1069376 hartree
pointgroup: C01 [X(C7H11N1O3)]
dipole: 2.3863554 0.75032 -0.7326422 debye
dipolederiv: -0.7536951 0.5367422 0.0528035 0.4183758 -1.4502507 0.0600558 0.1645891 -0.0098732 -0.2238061 -0.4769232 0.0573781 0.0170864 0.0545566 -1.1004238 0.0213794 0.0459802 0.0850848 -0.3221789 -0.9738965 0.3678778 0.1053711 0.5793527 -0.8963251 -0.0641928 0.1532175 -0.0476987 -0.3564212 -1.1323518 0.080634 0.0782705 0.1027153 -0.4446676 -0.0234809 0.1061737 0.0225455 -0.5311162 0.2073818 0.0627851 0.0090494 0.0066708 0.0581815 0.0156067 0.0647881 0.0430303 0.1080318 -0.0523118 -0.2662666 0.132352 -0.495129 0.2039628 0.111249 0.1866415 0.099532 0.2458089 0.0231491 -0.0291464 -0.037451 0.0280597 0.1484549 0.0236929 -0.0889478 0.0287852 0.0850781 -0.0612726 -0.0358632 -0.0005053 -0.0315209 0.0600764 0.0075845 0.003764 -0.0145781 -0.104916 1.115029 -0.5576876 -0.1214059 -0.125801 1.5845882 -0.0306103 -0.3437923 0.0112733 0.2984732 -0.0621598 -0.0148468 -0.0268564 -0.0524541 0.062975 0.0126893 0.0141058 0.0219267 0.0569952 1.7811782 -0.3279479 -0.3489558 -0.7025685 1.840852 -0.0325798 -0.4274808 -0.122092 0.4654863 0.0117793 0.0519544 0.0145567 0.0529497 -0.0963609 -0.0350341 -0.0004783 -0.0300528 0.030724 0.0607314 0.0480105 0.0287798 0.0690217 0.0186385 -0.0259283 0.0281271 -0.0557236 -0.0867639 0.0000809 0.1056998 0.0035402 0.0707878 -0.1604856 0.0100707 0.0115555 -0.0322088 0.0699047 0.0332765 -0.018106 -0.0246915 -0.0114659 0.0593853 -0.0505003 -0.0108279 -0.0211495 -0.2040382 0.08282 0.0700542 0.02851 0.0708839 -0.1093822 -0.0448834 0.015681 0.02404 0.0676098 -0.0782249 0.0231499 -0.1392168 0.0202509 0.0955497 -0.0116794 -0.125951 -0.0109343 0.0320281 -0.0195484 -0.0928505 0.09843 -0.0916685 0.0057614 0.051799 0.0798474 0.0259845 0.0516141 0.2404095 -0.0210993 0.0744981 0.0296319 0.1621805 0.005888 0.0969177 -0.0093147 0.3445252 -0.0908972 -0.0890111 0.0676896 -0.1136585 0.0226458 0.0751211 0.0990892 0.0750474 0.0322644 0.0583449 0.0287458 -0.0136636 0.1005289 -0.1418798 -0.017509 -0.0171225 -0.0239272 0.0869255 0.0871005 0.0197934 0.0018091 0.0204808 0.0765237 -0.058738 -0.0558773 -0.0596968 -0.1462287 unknown
polarizability: 105.9942244|-7.7795818|92.458245|-4.8524862|-1.0644088|67.5434524 unknown
InChI: InChI=1S/C7H11NO3/c1-3-4(2)5-6(9)11-7(10)8-5/h4-5,8H,3H2,1-2H3
charge 0 multiplicity 1
22 atoms
O  -2.151718 -0.490066 0.181003
O  -0.888684 -2.452795 -0.010884
O  -2.785533 1.797692 0.067242
N  -0.649708 1.021096 -0.638217
C  1.404925 -0.310652 0.121381
C  0.07774 -0.253529 -0.699714
C  2.47576 0.595069 -0.547148
C  1.174853 0.025026 1.611221
C  -0.982046 -1.23158 -0.162049
C  3.900311 0.390301 0.01244
C  -1.927589 0.931235 -0.126837
H  1.744762 -1.36417 0.04248
H  0.303551 -0.530766 -1.749658
H  2.188376 1.660862 -0.425366
H  2.490133 0.390682 -1.637942
H  0.811011 1.061299 1.738506
H  2.114181 -0.076521 2.180186
H  0.439243 -0.657643 2.073529
H  -0.267609 1.915505 -0.938979
H  4.631527 1.004401 -0.543205
H  4.211002 -0.667333 -0.076741
H  3.969514 0.675384 1.076951
