program: Gaussian 09
title: 000110717
version: EM64L-G09RevD.01
frameworkgroup: C1[X(C7H14O3)]
method: RPBEPBE
basis: SDD
operation: Freq
keyword: #pfreq=noraman
keyword: PBEPBE/SDD
title: #p freq=noraman PBEPBE/SDD
converged: YES YES NO NO
title: Mulliken charges:
elementType: O O O C C C C C C C H H H H H H H H H H H H H H
charge: -0.254836 -0.290850 -0.449356 -0.032324 -0.488769 -0.448212 -0.299505 -0.265127 -0.245055 -0.321203 0.227094 0.214336 0.237920 0.227672 0.225723 0.225623 0.187364 0.191467 0.204630 0.189575 0.200287 0.205719 0.206784 0.351043
chargesum: 0.00000
title: Mulliken charges with hydrogens summed into heavy atoms:
elementType: O O O C C C C C C C
charge: -0.254836 -0.290850 -0.098313 0.194770 -0.036513 0.005183 0.113483 0.130970 0.144807 0.091300
polarizability: 1.06058283e+02 -1.83206957e-01 7.58188654e+01 1.78907987e+00 1.73326080e+00 7.30162936e+01
1716.lowfreq: -6.2080 -0.0010 -0.0010 -0.0008 5.5499 9.5085 38.1471 43.2938 57.4486
frequency: 36.1633 42.0875 57.1279 85.2198 133.3618 166.1098 233.2311 273.8002 297.7570 368.5929 445.2403 470.8891 531.5191 574.0760 642.3224 771.2626 820.4415 861.0821 871.1491 881.4488 909.2261 927.6733 961.9677 978.4058 1016.0431 1032.2949 1048.7093 1073.8262 1093.0850 1098.2778 1126.2882 1149.6645 1169.7937 1190.4240 1205.8172 1215.5757 1222.9042 1266.2023 1309.0822 1312.6023 1317.0634 1330.6091 1341.9364 1347.6680 1384.1157 1398.5749 1448.5008 1461.6125 1463.0643 1467.2931 1471.0751 1491.4667 2909.4409 2932.7686 2953.1765 2970.0215 2975.7616 2992.2598 2996.0545 3007.9770 3014.9813 3070.4222 3075.8321 3082.1527 3090.4904 3538.7495
redmass: 3.2941 4.4478 3.7264 4.1954 2.6732 3.7458 1.9764 2.1359 3.6079 2.7493 2.6057 1.1718 2.5417 1.9609 3.6308 3.8373 2.2747 2.0819 2.6027 1.5618 2.0129 2.2970 1.9671 2.3503 2.9652 2.0981 3.3718 4.9705 1.7626 2.0102 1.9989 1.3770 1.4532 1.1770 1.2478 1.2199 1.2417 1.2908 1.2682 1.2829 1.2033 1.2030 1.2891 1.3760 1.2498 1.5347 1.0873 1.0863 1.0906 1.0846 1.0974 1.0929 1.0585 1.0549 1.0688 1.0760 1.0980 1.0669 1.0980 1.0868 1.0615 1.0962 1.0990 1.0972 1.1055 1.0651
irintensity: 1.4951 2.3525 4.3396 1.2950 2.3390 12.0070 3.0696 1.0740 2.7296 5.6661 8.5817 177.4622 5.4112 2.6237 2.7248 16.7827 11.3056 13.2222 16.8449 6.2384 9.4367 15.1078 31.9011 16.4552 84.4473 65.3261 55.7050 106.2553 4.0130 4.4018 1.4551 0.9078 8.2592 7.4486 11.8355 14.0083 5.8278 5.6506 9.8003 0.6254 18.0691 10.9649 3.1009 4.3320 29.2050 1.8178 15.1731 4.3184 8.4195 5.4603 10.7966 1.8854 50.7842 72.1692 82.2389 12.9779 34.5210 31.4430 102.9839 50.5519 27.0788 40.0439 20.1401 39.1740 58.6483 8.3414
temp: 298.150 k
press: 1.00000 atm
elementType: 8 8 8 6 6 6 6 6 6 6 1 1 1 1 1 1 1 1 1 1 1 1 1 1
symmnumber: 1
zpe: 540734.9 jmol-1
zpe.correction: 0.205955 hartree
zpe.thermalcorrener: 0.217082 hartree
zpe.thermalcorrenthalpy: 0.218026 hartree
zpe.thermalcorrgfe: 0.167258 hartree
zpe.sumelectzpe: -499.937370 hartree
zpe.sumelectthermal: -499.926243 hartree
zpe.sumelectthermalent: -499.925299 hartree
zpe.sumelectthermalfe: -499.976067 hartree
dipole: -3.4829 -1.5662 2.6027
dipole: 4.6214
quadrupole: -64.2201 -62.4208 -58.9548
quadrupole: 4.6830 7.4688 1.0580
quadrupole: -2.3549 -0.5555 2.9104 4.6830 7.4688 1.0580
hfenergy: -500.1433247 hartree
pointgroup: C01 [X(C7H14O3)]
dipole: 1.3925255 0.9579965 0.670058 debye
dipolederiv: -0.8033243 0.1181396 -0.0942425 0.2404395 -0.5195862 0.0879359 -0.1149929 0.1220628 -0.440836 -1.2900028 -0.1041107 0.1154966 -0.1185551 -0.41924 0.012677 0.110198 0.0119655 -0.4219776 -0.3152171 -0.1247827 -0.0793503 -0.1489182 -0.5643104 -0.0091762 -0.1670175 -0.0004387 -0.7699115 0.3731497 -0.1378661 0.0234777 -0.3282253 0.4136496 -0.107667 0.1435668 -0.1021268 0.3696786 -0.1132064 -0.0243695 0.0157532 0.0517086 -0.0302327 0.0196148 0.0125958 0.0932246 0.1299762 -0.024398 0.0345875 0.0379159 -0.0693354 -0.0233457 0.1097776 0.0155259 0.1051654 0.0727052 0.6323822 -0.1227519 0.167768 0.0434572 0.2505737 0.0593945 0.1188347 -0.0252705 0.3831661 0.758237 0.1705667 0.0320348 0.3185744 0.3590467 -0.0830351 0.1627994 -0.100968 0.2512847 0.6391143 -0.1008501 -0.1801977 -0.2489368 0.2913854 -0.0485122 -0.2939337 -0.0610257 0.3388446 0.2313089 0.007784 0.0208207 0.0336457 0.3792435 -0.0306755 0.0542263 -0.0835929 0.6006197 0.0080704 0.0073205 -0.068438 0.0323634 0.0097249 -0.0233062 -0.1008842 0.0058084 -0.1385629 0.053655 0.0135797 0.0191343 0.0194344 -0.0147123 -0.0857895 -0.0017956 -0.1451639 -0.0836414 0.0806369 0.0126199 -0.0105047 -0.0018558 -0.027214 0.1021777 0.0090791 0.1290283 -0.0516573 0.0681667 0.022858 0.0135556 0.0410101 0.0199477 -0.0701211 0.0746541 -0.0603633 -0.1281848 -0.1467206 -0.075365 -0.0388359 -0.0919209 0.0557196 -0.029418 -0.0799248 -0.0316559 0.0695843 -0.0261322 0.0979925 -0.0136769 0.1217696 -0.1270753 0.0105702 -0.003019 -0.0312906 0.0752158 -0.044647 0.0094966 -0.0390258 -0.0578161 0.0401961 -0.1011784 -0.09153 -0.0204969 -0.2223023 -0.07271 0.0456275 -0.0105703 -0.0660559 -0.2147271 0.0567056 -0.0209973 0.0679656 0.0413062 -0.0517187 -0.0248094 -0.032418 -0.0613443 0.0440587 0.0265511 -0.1035991 -0.0269505 -0.1599162 -0.0320676 0.0050392 -0.0780348 0.02977 0.0544367 0.0342429 0.0575882 0.0229122 -0.2303713 -0.0341883 -0.0103727 0.024782 0.0954623 -0.2072402 -0.0149361 0.0577806 0.0571249 0.0436362 -0.1200869 0.0353907 0.1030979 0.0660608 0.0769737 -0.0402769 0.0591847 -0.0136285 -0.0061266 0.0724843 0.0598509 -0.0413058 -0.0053093 -0.1908906 0.0868035 -0.0383303 0.0504904 -0.0326965 0.1572147 0.0844249 0.1127641 0.104577 0.3436181 0.0376414 0.139991 0.0372241 0.310167 unknown
polarizability: 106.0028562|-1.7659422|74.039999|-1.4294975|-2.1511231|74.8505868 unknown
InChI: InChI=1S/C7H14O3/c8-3-5-9-6-7-2-1-4-10-7/h7-8H,1-6H2
charge 0 multiplicity 1
24 atoms
O  1.510889 -1.140502 0.195279
O  -1.301706 0.012363 0.058631
O  -3.845398 -0.048436 -1.153836
C  1.074378 0.148088 -0.417857
C  2.32914 1.062904 -0.450198
C  3.508172 0.060149 -0.392179
C  2.946754 -1.026431 0.545656
C  -0.081922 0.756457 0.374925
C  -2.470535 0.46687 0.827968
C  -3.656669 -0.323444 0.273461
H  0.718251 -0.092194 -1.438464
H  2.347907 1.719167 0.442209
H  2.350945 1.704444 -1.346879
H  3.703022 -0.363029 -1.394058
H  4.440047 0.51426 -0.013464
H  3.396818 -2.022924 0.402593
H  3.055782 -0.726812 1.610003
H  -0.21381 1.827967 0.096153
H  0.142249 0.694944 1.462114
H  -2.325186 0.268589 1.912478
H  -2.62472 1.557485 0.673585
H  -4.592724 -0.016527 0.769384
H  -3.489087 -1.406295 0.450287
H  -2.957997 -0.176891 -1.580492
