program: Gaussian 09
title: 000110716
version: EM64L-G09RevD.01
frameworkgroup: C1[X(C14H13ClO)]
method: RPBEPBE
basis: SDD
operation: Freq
keyword: #p
keyword: freq=noraman
keyword: PBEPBE/SDD
title: #p freq=noraman PBEPBE/SDD
converged: YES YES NO NO
title: Mulliken charges:
elementType: Cl O C C C C C C C C C C C C C C H H H H H H H H H H H H H
charge: -0.072271 -0.417802 -0.337072 0.387240 0.429255 -0.723477 0.043087 -0.304063 -0.380964 -0.403402 -0.335769 -0.135570 -0.234417 -0.242597 -0.222561 -0.239803 0.185766 0.230975 0.229383 0.230414 0.280296 0.239583 0.244245 0.255333 0.228287 0.226456 0.256632 0.230397 0.352421
chargesum: 0.00000
title: Mulliken charges with hydrogens summed into heavy atoms:
elementType: Cl O C C C C C C C C C C C C C C
charge: -0.072271 -0.065381 -0.151306 0.387240 0.429255 -0.032705 0.043087 -0.023767 -0.141381 -0.159157 -0.080437 -0.135570 -0.006130 -0.016141 0.034072 -0.009406
polarizability: 1.85304560e+02 1.50526109e+01 1.66497734e+02 1.09756204e+01 2.46832723e+00 1.19191948e+02
1716.lowfreq: -10.8641 -8.5156 -0.0015 0.0006 0.0013 2.1334 24.6937 30.1427 55.5575
frequency: 24.6121 29.9435 55.5545 115.5716 120.4711 163.4685 207.6846 242.1598 258.2221 276.5619 287.3243 330.1049 344.0383 358.1532 402.2520 411.0151 452.0922 463.3580 486.1111 559.1479 587.9398 601.8031 617.1122 635.5668 704.2452 726.3893 732.2398 776.5519 789.2889 818.8369 849.7128 854.9210 895.2057 923.1504 943.9586 978.7980 980.7965 991.7584 997.4268 1026.2330 1038.7610 1059.9063 1074.8184 1079.6533 1103.1617 1146.2756 1164.7441 1174.1385 1194.5057 1212.9610 1243.5259 1273.7588 1281.2446 1298.4504 1331.7147 1378.9146 1389.7376 1390.4838 1409.6474 1437.5248 1462.0192 1474.7802 1484.3558 1487.1345 1578.1261 1593.0963 1613.8882 1617.6474 2893.9119 2984.3016 3078.1721 3087.3962 3116.6316 3127.4105 3140.4495 3152.2587 3159.6785 3161.0276 3165.7912 3180.8803 3570.7871
redmass: 3.8252 4.9096 5.8554 3.6174 7.3857 5.5579 3.9436 5.2115 2.8131 2.0659 1.7214 1.2918 3.1652 14.2098 2.8144 3.6286 3.9132 3.9203 3.1016 4.1020 4.0896 4.5189 6.3952 6.3938 1.8908 3.2774 2.7590 4.1056 2.1500 1.4589 4.4147 1.2526 1.3796 1.3925 1.3400 1.5114 2.0004 4.7759 1.3457 2.1948 1.9279 2.0004 1.9127 2.0605 1.6564 1.4172 1.8275 1.0524 1.1158 2.2994 2.0101 1.5559 1.4748 1.6353 1.3112 6.5559 1.2459 4.7955 3.4143 2.1832 2.5597 1.0643 1.4887 1.4621 7.0502 6.0018 6.1241 7.0160 1.0812 1.0355 1.0998 1.1005 1.0873 1.0862 1.0919 1.0949 1.0919 1.0887 1.1012 1.0978 1.0654
irintensity: 0.0438 0.1236 0.2586 0.3342 0.1228 0.4057 0.9477 1.8086 0.8513 2.9676 1.0980 96.0202 11.8412 2.7997 0.1789 1.2777 5.0023 12.9240 19.8006 15.3121 8.2704 25.8031 1.9115 8.7768 52.0686 2.3625 4.6645 1.8347 49.0834 42.6985 16.4337 0.3495 12.0226 3.4660 0.3055 0.9782 4.1712 1.3628 0.7695 19.3792 5.5321 6.3903 7.9424 0.9827 9.1054 212.9517 67.1190 0.1767 1.2319 7.7336 5.5041 4.9268 22.2627 4.5222 0.9950 6.8912 13.7681 21.8358 4.5916 8.7326 140.0941 4.4415 27.7832 8.5485 3.4136 2.3837 8.6429 0.6425 35.0595 22.7185 30.4807 27.1344 7.9968 0.0364 18.6654 34.7780 0.7292 1.6166 18.8150 4.8939 27.1184
temp: 298.150 k
press: 1.00000 atm
elementType: 17 8 6 6 6 6 6 6 6 6 6 6 6 6 6 6 1 1 1 1 1 1 1 1 1 1 1 1 1
symmnumber: 1
zpe: 597136.7 jmol-1
zpe.correction: 0.227437 hartree
zpe.thermalcorrener: 0.241935 hartree
zpe.thermalcorrenthalpy: 0.242880 hartree
zpe.thermalcorrgfe: 0.184469 hartree
zpe.sumelectzpe: -1075.432818 hartree
zpe.sumelectthermal: -1075.418320 hartree
zpe.sumelectthermalent: -1075.417376 hartree
zpe.sumelectthermalfe: -1075.475787 hartree
dipole: 2.4174 -1.7888 0.1027
dipole: 3.0090
quadrupole: -97.3957 -103.6771 -97.7271
quadrupole: 2.9105 2.1120 -1.9326
quadrupole: 2.2043 -4.0772 1.8729 2.9105 2.1120 -1.9326
hfenergy: -1075.6602558 hartree
pointgroup: C01 [X(C14H13Cl1O1)]
dipole: -0.8412906 -0.8284933 -0.0853396 debye
polarizability: 188.7085024|-12.2427222|162.6880514|12.046237|0.4311329|119.5976886 unknown
InChI: InChI=1S/C14H13ClO/c1-10(11-5-3-2-4-6-11)13-9-12(15)7-8-14(13)16/h2-10,16H,1H3
charge 0 multiplicity 1
29 atoms
Cl 2.192105 3.396952 -0.284895
O  2.237199 -2.571175 0.541083
C  -0.316589 -1.34281 -0.37828
C  0.949705 -0.526844 -0.064813
C  -1.608273 -0.553013 -0.116573
C  -0.208822 -1.933482 -1.810902
C  2.149011 -1.177908 0.347154
C  0.986671 0.876757 -0.250715
C  -1.934024 -0.19623 1.219587
C  -2.492628 -0.162298 -1.151373
C  3.339321 -0.451134 0.57077
C  2.179281 1.586893 -0.032264
C  -3.108857 0.525807 1.514785
C  -3.671989 0.564082 -0.860215
C  3.363713 0.9448 0.378599
C  -3.985608 0.910399 0.472042
H  -0.356919 -2.204756 0.328955
H  -0.152063 -1.128262 -2.564303
H  -1.076121 -2.5762 -2.046834
H  0.709805 -2.538477 -1.915898
H  0.078492 1.404628 -0.556221
H  -1.253521 -0.481801 2.031809
H  -2.273039 -0.423697 -2.191587
H  4.234554 -0.99167 0.890911
H  -3.341245 0.788949 2.552776
H  -4.343376 0.857439 -1.675209
H  4.281146 1.515378 0.547416
H  -4.899168 1.471789 0.697102
H  1.350838 -3.001714 0.450093
