program: Gaussian 09
title: 000110709
version: EM64L-G09RevD.01
frameworkgroup: C1[X(C7H9NO2)]
method: RPBEPBE
basis: SDD
operation: Freq
keyword: #pfreq=noraman
keyword: PBEPBE/SDD
title: #p freq=noraman PBEPBE/SDD
converged: NO NO NO NO
title: Mulliken charges:
elementType: O O N C C C C C C C H H H H H H H H H
charge: -0.201584 -0.201587 -0.358595 -0.218790 -0.218754 -0.453507 -0.453468 -0.436450 0.120840 0.120854 0.272679 0.272671 0.257608 0.216785 0.216752 0.257617 0.236564 0.221909 0.348454
chargesum: 0.00000
title: Mulliken charges with hydrogens summed into heavy atoms:
elementType: O O N C C C C C C C
charge: -0.201584 -0.201587 -0.010141 0.053889 0.053917 0.020886 0.020902 0.022023 0.120840 0.120854
polarizability: 8.19110546e+01 1.79794704e-01 9.73422693e+01 4.10934558e+00 -4.76862121e-02 6.16042038e+01
1716.lowfreq: -16.3099 -6.2249 0.0001 0.0003 0.0004 16.0810 60.6247 144.7377 168.7857
frequency: 60.4873 144.7372 168.7180 241.5149 300.3653 370.6084 472.8643 531.3595 543.8465 600.7163 656.2922 671.1244 750.5924 761.1310 779.6849 818.5357 867.4974 901.9640 915.7676 926.0715 955.7260 1036.8554 1062.0441 1091.6259 1098.1105 1144.5759 1163.6197 1189.4680 1223.8849 1251.3739 1252.5144 1277.9553 1281.0574 1293.9783 1315.0040 1319.9795 1324.3315 1469.7730 1476.5477 1485.3120 1657.7577 1695.0093 2999.0686 3006.7746 3007.5196 3039.0998 3054.0307 3068.3212 3075.7304 3085.7994 3542.9828
redmass: 3.8572 9.4278 3.1167 3.0200 2.1220 6.1917 5.9564 4.1113 2.0546 10.2199 4.7285 2.5764 1.5637 2.7986 3.5237 2.8745 2.0832 2.2309 1.6850 2.6404 2.1303 1.6253 1.7823 1.9084 1.3766 1.5969 2.0542 2.1321 1.6121 1.3988 1.3981 1.7050 3.4940 1.3857 1.3252 1.5088 1.7350 1.0837 1.0790 1.0976 7.5098 12.4002 1.0647 1.0626 1.0635 1.0843 1.0870 1.0979 1.1026 1.1048 1.0790
irintensity: 0.0386 12.0484 0.4364 0.1734 3.5971 16.7381 1.1496 18.2480 4.6521 4.4261 0.0359 15.9762 95.5879 5.0640 38.4395 0.9028 1.0707 6.8151 0.1045 0.6881 27.5190 1.8473 10.1220 8.9406 45.3360 16.1144 0.0043 102.9806 58.8814 2.4385 0.2845 12.5560 88.9748 0.4635 5.3417 7.7732 10.3273 25.2087 9.1361 6.9099 610.9750 55.6348 24.3898 22.1759 33.4091 13.2052 16.5541 20.1622 7.6605 44.3162 44.8936
temp: 298.150 k
press: 1.00000 atm
elementType: 8 8 7 6 6 6 6 6 6 6 1 1 1 1 1 1 1 1 1
symmnumber: 1
zpe: 403319.2 jmol-1
zpe.correction: 0.153616 hartree
zpe.thermalcorrener: 0.161739 hartree
zpe.thermalcorrenthalpy: 0.162683 hartree
zpe.thermalcorrgfe: 0.120300 hartree
zpe.sumelectzpe: -476.628533 hartree
zpe.sumelectthermal: -476.620410 hartree
zpe.sumelectthermalent: -476.619466 hartree
zpe.sumelectthermalfe: -476.661850 hartree
dipole: 2.4836 -0.0284 0.9472
dipole: 2.6583
quadrupole: -55.3965 -76.0511 -54.9419
quadrupole: -0.2374 1.1195 -0.0115
quadrupole: 6.7333 -13.9212 7.1879 -0.2374 1.1195 -0.0115
hfenergy: -476.7821496 hartree
pointgroup: C01 [X(C7H9N1O2)]
dipole: -0.0045734 -0.9715299 -0.3871832 debye
dipolederiv: -1.1241159 -0.174392 -0.0359661 -0.2444187 -0.563006 -0.0692904 -0.1574847 -0.1263117 -0.3818272 -1.1201318 0.1796875 0.0351624 0.2496903 -0.5669812 -0.0696111 0.1561268 -0.1277749 -0.3818122 -1.5814873 0.0050452 -0.0004146 0.0050351 -0.5255347 -0.0462916 -0.0007716 -0.1169933 -0.3298994 -0.0150763 -0.0267375 -0.0396137 -0.0609831 -0.318847 -0.1112064 -0.0391535 -0.1116667 0.0388202 -0.0142675 0.0236635 0.0384485 0.0580386 -0.3194168 -0.1116346 0.0380803 -0.1122723 0.0387204 0.0235876 -0.0260308 0.0017431 -0.0285074 0.1946255 0.0391893 -0.006987 -0.0209163 0.0791116 0.0240449 0.0277548 -0.0013793 0.0300921 0.1939575 0.0393763 0.0067181 -0.0207687 0.0790218 0.0138742 0.0002421 0.0003584 0.0001603 0.0597511 0.0810157 0.000081 0.0202562 0.0698173 1.7557445 0.0577217 -0.0145682 -0.1806769 0.829046 0.2558915 -0.0881322 0.4012805 0.3245597 1.7567323 -0.0666284 0.0173462 0.1718684 0.8277966 0.2558903 0.0922723 0.4004892 0.3247672 0.0359972 -0.0274874 0.0603288 -0.0188512 0.058015 0.022141 0.0715235 0.0278602 -0.0546014 0.0365609 0.0277321 -0.0600439 0.0190745 0.0575045 0.0227932 -0.0711678 0.0286373 -0.0546629 -0.0850859 0.0141827 -0.0621945 -0.0445493 0.0852229 -0.0107263 -0.0837047 0.0183703 0.0397067 0.0718252 0.0041618 0.02081 0.0449844 -0.0984892 -0.090825 0.0587244 -0.0910336 -0.050806 0.0714634 -0.0056112 -0.0214918 -0.046482 -0.0979959 -0.0907278 -0.0594599 -0.0905194 -0.0509493 -0.0849212 -0.012624 0.0619193 0.0461513 0.0849274 -0.0112621 0.0837419 0.0175946 0.0398767 0.0766087 -0.0011218 0.0005171 -0.0011203 -0.1475966 0.1051543 0.0004395 0.0891858 0.0488815 0.0220636 -0.00005 -0.0006036 0.0000238 0.0104971 -0.1397395 -0.0003842 -0.0910108 -0.0842545 0.1365835 0.0004914 -0.0003581 0.0004704 0.2365238 -0.0701367 -0.0004622 -0.0944065 0.3055297 unknown
polarizability: 97.3440325|-0.0716631|81.7822636|0.0270304|4.410376|61.7312315 unknown
InChI: InChI=1S/C7H9NO2/c9-6-4-2-1-3-5(4)7(10)8-6/h4-5,8H,1-3H2
charge 0 multiplicity 1
19 atoms
O  2.351507 1.311085 0.247419
O  -2.338775 1.3333 0.246841
N  0.007616 1.58851 0.354671
C  0.780264 -0.35533 -0.781147
C  -0.783148 -0.347746 -0.781691
C  1.210809 -1.653682 -0.028728
C  -1.226859 -1.642046 -0.030031
C  -0.010173 -1.999731 0.863346
C  1.1929 0.919765 -0.02567
C  -1.183854 0.931085 -0.026033
H  1.225349 -0.305949 -1.789836
H  -1.226987 -0.293574 -1.790696
H  2.147758 -1.506182 0.53555
H  1.383646 -2.461683 -0.763745
H  -1.406451 -2.448274 -0.765381
H  -2.163011 -1.485814 0.53321
H  -0.015361 -3.056344 1.18204
H  -0.007747 -1.377138 1.779063
H  0.011714 2.466046 0.881617
