program: Gaussian 09
title: 000110699
version: EM64L-G09RevD.01
frameworkgroup: C1[X(C10H20NO5P)]
method: RPBEPBE
basis: SDD
operation: Freq
keyword: #p
keyword: freq=noraman
keyword: PBEPBE/SDD
title: #p freq=noraman PBEPBE/SDD
converged: YES YES NO NO
title: Mulliken charges:
elementType: P O O O O O N C C C C C C C C C C H H H H H H H H H H H H H H H H H H H H
charge: 1.449605 -0.502470 -0.531363 -0.520160 -0.630915 -0.275901 -0.125490 -0.243781 0.270982 0.006232 -0.196819 -0.214491 -0.620199 -0.607316 -0.671357 -0.661769 -0.591235 0.230492 0.303123 0.232389 0.233250 0.222568 0.229395 0.230973 0.229857 0.281329 0.251723 0.231708 0.229362 0.230519 0.224499 0.205113 0.202150 0.232672 0.231536 0.226145 0.207644
chargesum: 0.00000
title: Mulliken charges with hydrogens summed into heavy atoms:
elementType: P O O O O O N C C C C C C C C C C
charge: 1.449605 -0.502470 -0.531363 -0.520160 -0.630915 -0.275901 -0.125490 -0.013289 0.270982 0.309355 0.268820 0.237473 0.121960 0.105476 -0.011226 0.004588 -0.157446
polarizability: 1.91696754e+02 -1.07272654e+01 1.75563524e+02 1.54924239e+00 -1.13487641e+00 1.20659671e+02
1716.lowfreq: -5.7423 -2.3220 0.0010 0.0013 0.0014 7.3919 23.6223 38.5782 40.9652
frequency: 23.3323 38.4868 40.9168 53.7550 55.2594 69.4271 76.2041 80.3425 94.2482 102.8806 118.9576 132.9821 142.5462 174.1876 182.8659 212.3415 221.2005 227.9036 239.1700 248.1135 278.1401 299.9958 305.5030 314.8027 345.8774 361.4413 387.8368 398.8120 431.3749 446.7542 500.8590 567.4511 613.1705 644.5897 670.9533 690.4294 732.8643 803.3324 813.6821 832.3225 883.5103 886.6839 898.1921 956.9758 968.4510 990.7202 1016.6306 1021.1704 1027.6292 1052.8711 1054.3356 1092.3690 1100.6402 1107.2075 1125.0700 1133.0253 1138.2660 1139.4151 1147.0641 1233.7097 1247.5975 1254.0171 1254.7624 1293.7839 1308.6269 1354.1522 1357.5440 1390.2626 1391.1409 1393.2665 1416.3881 1429.2136 1447.2847 1456.7633 1457.7579 1469.5626 1472.7819 1474.2727 1479.9504 1486.3554 1487.7437 1491.0055 1495.9713 1596.1349 1651.0770 2975.3805 2981.2439 2987.8696 2992.2931 3000.6038 3023.5924 3038.5011 3055.4438 3060.2396 3063.4989 3082.9747 3083.7712 3086.4777 3089.6617 3110.4108 3114.4983 3120.9696 3121.8606 3126.2644 3194.7054
redmass: 3.9465 3.1492 3.3838 1.7525 1.5928 3.4739 2.9874 2.7553 2.9682 3.2853 2.2217 1.1617 5.0571 4.2676 4.6324 3.7945 2.4011 3.0689 1.2630 1.5427 3.0396 4.2001 4.0562 3.1674 5.3492 4.2195 3.6917 4.3421 5.7039 3.8256 3.9343 7.1203 4.4487 3.7433 7.0637 5.9584 3.1702 1.1053 1.0865 3.8527 3.6275 3.9144 2.5827 1.3388 2.3338 4.8226 2.7089 1.3548 2.4527 5.2725 1.5519 1.2395 2.2158 2.2563 2.1876 1.4125 1.5023 1.4864 2.1043 2.1011 2.2113 1.1506 1.1321 1.2128 1.1617 1.2429 1.2431 2.7639 1.2521 1.2535 1.1762 1.1877 1.1691 1.0399 1.0413 1.0536 1.0607 1.0587 1.0489 1.0716 1.0494 1.0877 1.2528 6.4424 4.4688 1.0363 1.0381 1.0359 1.0367 1.0560 1.0604 1.0851 1.1019 1.0996 1.1077 1.0627 1.0971 1.1030 1.0977 1.1025 1.1055 1.0949 1.0959 1.0978 1.1130
irintensity: 0.4585 2.9321 2.5217 2.9240 0.6499 7.6321 1.3832 1.0432 2.0730 0.3189 0.7943 0.0665 4.8593 0.2348 5.2063 3.7319 1.6975 2.6039 3.4752 2.2903 6.5366 13.3917 15.2218 15.2687 24.7911 32.4993 5.6677 8.1862 26.3703 19.0858 10.8575 40.0971 11.2969 75.6702 144.0331 113.2445 56.8930 3.8484 2.4896 8.6412 165.7861 187.7431 25.3165 81.0817 30.0456 249.5843 191.0538 98.5271 22.5693 89.0958 21.3562 2.9512 20.4556 19.9154 16.0572 3.6086 10.8606 7.9380 35.1958 10.5532 19.3294 0.9913 0.9864 1.7420 7.4311 4.4782 2.7319 44.5339 22.8976 24.9850 34.6475 15.3261 6.3451 10.3047 12.0751 12.6664 16.6738 11.0847 5.0094 11.6532 25.0123 8.1446 14.6314 377.2644 3.2810 35.4906 78.0570 26.0486 22.7835 32.5464 20.4234 19.5739 40.3167 17.2078 10.5082 10.2822 34.6561 0.8751 31.9771 37.6219 43.4656 11.2008 14.3264 1.2998 15.8928
temp: 298.150 k
press: 1.00000 atm
elementType: 15 8 8 8 8 8 7 6 6 6 6 6 6 6 6 6 6 1 1 1 1 1 1 1 1 1 1 1 1 1 1 1 1 1 1 1 1
symmnumber: 1
zpe: 782459.0 jmol-1
zpe.correction: 0.298023 hartree
zpe.thermalcorrener: 0.320400 hartree
zpe.thermalcorrenthalpy: 0.321344 hartree
zpe.thermalcorrgfe: 0.244628 hartree
zpe.sumelectzpe: -1163.742603 hartree
zpe.sumelectthermal: -1163.720225 hartree
zpe.sumelectthermalent: -1163.719281 hartree
zpe.sumelectthermalfe: -1163.795998 hartree
dipole: 5.2758 -0.1167 -3.7092
dipole: 6.4503
quadrupole: -84.2627 -100.4808 -115.6034
quadrupole: -3.3098 2.1964 2.7725
quadrupole: 15.8529 -0.3652 -15.4878 -3.3098 2.1964 2.7725
hfenergy: -1164.0406257 hartree
pointgroup: C01 [X(C10H20N1O5P1)]
dipole: 2.2599413 0.1040626 1.1497697 debye
polarizability: 192.5365744|0.448574|162.8961808|-15.4217423|-19.1319085|132.4871934 unknown
InChI: InChI=1S/C10H20NO5P/c1-6-9(10(12)11(4)5)16-17(13,14-7-2)15-8-3/h6,9H,1,7-8H2,2-5H3
charge 0 multiplicity 1
37 atoms
P  -1.293252 0.335418 -0.332303
O  0.081559 1.237243 0.306152
O  -2.070904 -0.447434 0.986348
O  -2.366071 1.660041 -0.512697
O  -1.06937 -0.463129 -1.682937
O  0.827941 -1.343198 0.614029
N  3.111359 -0.925075 0.462005
C  1.461932 0.906614 -0.085015
C  1.786848 -0.545666 0.366208
C  1.692205 1.101287 -1.575527
C  -1.93301 -1.92029 1.208094
C  -2.749583 2.493362 0.664962
C  3.4282 -2.332341 0.776807
C  4.265849 -0.051853 0.190082
C  -3.277814 -2.402733 1.745239
C  -3.702038 3.557446 0.127547
C  2.498963 2.060912 -2.089252
H  2.056233 1.63727 0.491695
H  1.126311 0.420842 -2.226024
H  -1.111353 -2.067357 1.92665
H  -1.660578 -2.407153 0.254699
H  -1.834744 2.93903 1.098587
H  -3.232668 1.843113 1.416957
H  4.044008 -2.775259 -0.028335
H  3.984357 -2.400125 1.730645
H  2.485295 -2.891465 0.86526
H  4.625709 -0.16477 -0.850607
H  4.019026 1.007482 0.351614
H  5.086513 -0.319224 0.879567
H  -4.079426 -2.251521 1.002376
H  -3.547314 -1.860512 2.668334
H  -3.216495 -3.481801 1.982926
H  -4.032597 4.218052 0.951027
H  -4.591195 3.087721 -0.326027
H  -3.202851 4.172502 -0.640169
H  2.619597 2.180944 -3.171277
H  3.046957 2.768125 -1.451839
