program: Gaussian 09
title: 000110698
version: EM64L-G09RevD.01
frameworkgroup: C1[X(C10H18S)]
method: RPBEPBE
basis: SDD
operation: Freq
keyword: #pfreq=noraman
keyword: PBEPBE/SDD
title: #p freq=noraman PBEPBE/SDD
converged: YES YES NO NO
title: Mulliken charges:
elementType: S C C C C C C C C C C H H H H H H H H H H H H H H H H H H
charge: 0.166367 -0.043334 -0.068584 -0.081689 -0.469935 -0.469907 -0.436200 -0.436267 -0.724959 -0.689226 -0.689212 0.203141 0.227678 0.202178 0.202181 0.227665 0.202273 0.242872 0.242943 0.202257 0.207406 0.229982 0.229985 0.237045 0.222897 0.201252 0.201253 0.222898 0.237040
chargesum: 0.00000
title: Mulliken charges with hydrogens summed into heavy atoms:
elementType: S C C C C C C C C C C
charge: 0.166367 0.159807 -0.068584 -0.081689 -0.040079 -0.040061 0.008945 0.008933 -0.057586 -0.028032 -0.028021
polarizability: 1.38244459e+02 -9.37948281e-03 1.12370672e+02 -5.83256539e-05 1.07039561e-03 1.04580672e+02
1716.lowfreq: -4.4355 -0.0025 0.0021 0.0022 14.3057 16.9212 20.9851 185.7008 200.7099
frequency: 19.1616 185.5521 200.6860 206.4176 223.3206 241.3505 262.7796 280.6177 311.1910 341.3249 355.3093 362.3985 380.4842 400.3141 427.9305 493.2089 534.2011 538.2982 544.8474 708.0210 778.5184 784.9771 821.0579 873.1191 882.3827 911.6560 923.0526 935.3698 947.2434 986.7542 1004.5481 1022.2262 1052.6968 1088.0104 1103.4736 1119.9862 1129.3698 1148.5039 1158.2198 1210.6067 1216.1834 1233.1707 1235.9706 1267.5763 1269.1898 1304.4900 1304.8702 1331.0314 1336.8575 1344.8002 1376.5768 1383.7403 1394.2873 1449.9625 1452.9975 1461.9354 1462.4563 1465.9032 1469.8807 1473.6067 1480.1874 1489.9342 1505.6031 2955.8376 2960.8340 2965.1601 2965.3009 2970.6480 2972.6538 2999.3110 3006.8224 3036.8369 3039.4493 3060.0005 3061.5737 3063.8527 3065.8762 3068.9733 3081.4918 3097.7096 3101.9982
redmass: 2.8648 1.7143 1.0890 1.3248 2.3008 1.5702 1.6714 2.2859 2.1441 2.6022 2.9304 2.7636 2.1868 3.3833 2.5317 4.9092 4.0275 3.9460 4.0089 3.4370 2.0221 1.2780 2.7478 1.7572 2.1741 2.8595 1.6616 1.4871 1.9383 1.4159 1.4200 1.8762 1.9991 1.6813 2.4444 1.2410 2.6575 2.1868 2.1408 2.0034 1.4769 2.0059 1.2721 1.4742 1.1964 1.7792 1.5390 1.3488 1.5171 1.5328 1.2066 1.2055 1.2012 1.0694 1.0548 1.0595 1.0761 1.0566 1.0581 1.0501 1.0612 1.0723 1.0730 1.0808 1.0645 1.0605 1.0405 1.0408 1.0400 1.0650 1.0671 1.0961 1.0964 1.0951 1.0994 1.0983 1.0952 1.0986 1.0996 1.0978 1.0973
irintensity: 0.7995 0.1981 0.0138 0.0056 0.1480 0.4561 0.0788 0.4333 0.4257 0.4855 0.0935 0.8623 0.2975 0.0236 0.8639 0.1101 6.1508 5.7705 0.1552 0.6030 2.4896 1.4019 6.6675 7.7578 1.4704 0.2881 0.7361 0.1728 5.2729 3.5689 1.1039 2.2726 11.5588 24.5785 0.3373 1.2722 8.6489 6.1826 4.7474 19.5189 0.5015 2.9362 18.8825 0.3818 4.7791 5.5554 3.0007 1.8503 3.5838 1.1979 20.3298 17.3188 18.1842 0.0150 2.5508 1.2774 9.0074 12.5875 5.7041 4.2348 30.2615 22.9489 1.5039 13.7345 14.6098 39.0025 15.5460 102.0365 64.1779 38.4785 94.8330 0.4765 8.3502 1.8081 41.3159 5.9561 32.8733 90.4014 27.8192 30.1144 26.7784
temp: 298.150 k
press: 1.00000 atm
elementType: 16 6 6 6 6 6 6 6 6 6 6 1 1 1 1 1 1 1 1 1 1 1 1 1 1 1 1 1 1
symmnumber: 1
zpe: 676396.9 jmol-1
zpe.correction: 0.257626 hartree
zpe.thermalcorrener: 0.269365 hartree
zpe.thermalcorrenthalpy: 0.270309 hartree
zpe.thermalcorrgfe: 0.220630 hartree
zpe.sumelectzpe: -789.038966 hartree
zpe.sumelectthermal: -789.027227 hartree
zpe.sumelectthermalent: -789.026283 hartree
zpe.sumelectthermalfe: -789.075962 hartree
dipole: -0.0642 2.0751 0.0004
dipole: 2.0761
quadrupole: -72.6774 -79.2663 -76.8774
quadrupole: -0.1996 0.0001 -0.0005
quadrupole: 3.5963 -2.9926 -0.6037 -0.1996 0.0001 -0.0005
hfenergy: -789.2965919 hartree
pointgroup: C01 [X(C10H18S1)]
dipole: 0.0309113 0.8162116 -0.0007689 debye
polarizability: 138.2433449|-0.1699979|112.37178|0.0008059|-0.0067782|104.5806779 unknown
InChI: InChI=1S/C10H18S/c1-9(2)8-4-6-10(3,11-9)7-5-8/h8H,4-7H2,1-3H3
charge 0 multiplicity 1
29 atoms
S  -0.006224 -1.633657 0.001406
C  -0.826697 1.081866 -0.000786
C  1.459963 -0.380643 0.00023
C  -1.460166 -0.344502 0.00011
C  0.046277 1.370053 1.253487
C  0.046483 1.368526 -1.255285
C  1.344901 0.498687 1.267708
C  1.344635 0.496465 -1.268744
C  2.740562 -1.231479 0.000831
C  -2.3178 -0.606144 -1.259385
C  -2.31821 -0.604349 1.259694
H  -1.681889 1.792411 -0.00129
H  -0.535533 1.216114 2.178455
H  0.31497 2.443674 1.231572
H  0.315769 2.442016 -1.234151
H  -0.535356 1.214227 -2.180175
H  2.242913 1.149056 1.316175
H  1.372428 -0.157772 2.155722
H  1.371333 -0.161624 -2.155576
H  2.242938 1.146301 -1.318945
H  3.630339 -0.572132 0.000236
H  2.791833 -1.876996 0.896159
H  2.7917 -1.878437 -0.893462
H  -1.727742 -0.528294 -2.186533
H  -2.745965 -1.624125 -1.225085
H  -3.15748 0.116432 -1.310681
H  -3.157895 0.118307 1.309716
H  -2.746369 -1.622377 1.226696
H  -1.728419 -0.525203 2.186902
