program: Gaussian 09
title: 000110697
version: EM64L-G09RevD.01
frameworkgroup: C1[X(C7H12O)]
method: RPBEPBE
basis: SDD
operation: Freq
keyword: #pfreq=noraman
keyword: PBEPBE/SDD
title: #p freq=noraman PBEPBE/SDD
converged: YES YES NO NO
title: Mulliken charges:
elementType: O C C C C C C C H H H H H H H H H H H H
charge: -0.179474 -0.160709 -0.118035 -0.715683 -0.714209 -0.038345 -0.097402 -0.607070 0.205012 0.233983 0.230620 0.230473 0.215424 0.232426 0.249093 0.205974 0.229924 0.158683 0.218737 0.220577
chargesum: 0.00000
title: Mulliken charges with hydrogens summed into heavy atoms:
elementType: O C C C C C C C
charge: -0.179474 0.044303 0.115948 -0.039166 -0.026715 0.191579 0.061281 -0.167755
polarizability: 1.00381264e+02 -8.78461004e+00 6.87559005e+01 5.15863380e+00 -2.82254675e+00 6.53648118e+01
1716.lowfreq: -20.6675 -9.8306 -4.9946 -0.0007 -0.0006 -0.0001 51.1441 61.8374 84.5296
frequency: 51.0781 61.8104 84.5196 188.3741 203.3983 215.7209 245.5072 282.8501 329.7504 344.2856 390.8478 471.1167 535.3565 681.9702 812.0236 871.4812 903.8600 940.7199 946.9830 962.2011 995.7125 1007.6735 1036.1130 1094.1188 1128.6002 1147.6722 1177.3673 1239.0604 1276.1715 1284.3191 1292.3634 1314.4496 1379.4985 1389.1740 1390.2684 1427.7753 1470.5713 1472.8339 1475.8683 1477.4221 1643.4119 1653.5946 2827.9517 2971.0915 2976.9504 2979.0404 3015.3961 3063.9308 3070.1670 3074.5914 3085.8929 3089.3679 3091.5625 3193.9945
redmass: 3.4390 4.8188 2.6575 1.4503 1.2367 1.2437 2.3578 1.9745 2.2133 3.0003 2.6800 3.0562 3.0204 1.7195 1.8729 1.8306 1.6272 1.9311 1.3346 1.2237 1.2355 1.1562 3.5000 2.8758 2.2842 2.0450 1.9991 1.3719 1.3213 1.2745 1.3573 1.3240 1.1779 1.2010 1.2096 1.1972 1.0501 1.0492 1.0471 1.0535 7.4748 4.8869 1.0834 1.0821 1.0360 1.0371 1.0853 1.0849 1.0966 1.0972 1.0992 1.0712 1.1003 1.1143
irintensity: 1.8974 6.8824 0.4600 0.9337 0.2711 0.4843 2.9930 0.4002 3.0858 1.7390 2.9546 0.4077 7.8625 15.3262 1.3304 23.7205 22.6173 7.1389 73.0142 10.3774 21.6102 19.0969 13.1077 1.0397 4.7349 1.3908 4.2571 3.3050 0.2866 1.3305 1.0862 0.5640 8.8657 7.8782 10.8353 8.0983 5.2119 16.0839 8.4591 11.1336 142.6048 52.0349 105.5703 12.8640 29.1727 19.2370 16.6554 4.2251 34.0636 53.3874 33.7356 3.7780 17.6189 25.8462
temp: 298.150 k
press: 1.00000 atm
elementType: 8 6 6 6 6 6 6 6 1 1 1 1 1 1 1 1 1 1 1 1
symmnumber: 1
zpe: 447031.5 jmol-1
zpe.correction: 0.170265 hartree
zpe.thermalcorrener: 0.180380 hartree
zpe.thermalcorrenthalpy: 0.181324 hartree
zpe.thermalcorrgfe: 0.134721 hartree
zpe.sumelectzpe: -348.485234 hartree
zpe.sumelectthermal: -348.475119 hartree
zpe.sumelectthermalent: -348.474175 hartree
zpe.sumelectthermalfe: -348.520778 hartree
dipole: 2.8686 -0.7208 0.8574
dipole: 3.0795
quadrupole: -61.7427 -49.9734 -47.2047
quadrupole: 1.5467 -2.8013 -0.0875
quadrupole: -8.7691 3.0002 5.7689 1.5467 -2.8013 -0.0875
hfenergy: -348.6554989 hartree
pointgroup: C01 [X(C7H12O1)]
dipole: 1.1265082 0.2933278 -0.3359684 debye
dipolederiv: -0.9574777 -0.1744613 0.083215 -0.2203909 -0.3333476 0.0279271 0.1819103 0.0524833 -0.4616313 0.1305929 -0.0692441 -0.0315869 -0.133137 0.1000004 -0.0158853 -0.0665224 0.0058306 0.1116085 -0.3722464 -0.1344223 -0.0468001 -0.1868207 -0.0520813 -0.029596 -0.2058926 -0.0484984 0.0486589 -0.0161424 -0.0239519 0.0065392 0.03246 -0.0570437 0.0081321 -0.0370896 -0.0409229 0.0910609 -0.0560642 -0.0224395 -0.0176172 0.0202919 -0.0080426 0.0162887 -0.0799838 -0.04793 0.0794184 0.1763581 0.1392526 0.0100551 0.1841146 -0.1913266 -0.0475741 0.1803388 -0.0242855 0.1530078 1.1698352 0.3156813 -0.0758082 0.4228116 0.1520298 -0.0409229 0.1189495 0.0130715 0.7457796 -0.2012516 0.0643978 0.080883 0.0790494 -0.3786231 -0.032766 0.0666235 -0.0344719 0.0782639 0.0224885 0.0024688 0.0179602 -0.0111597 0.0139843 0.0719162 -0.0003253 0.0319435 -0.1589491 0.0385081 0.0055293 -0.0000056 -0.0023584 0.0260028 0.0577907 0.0002306 0.0241041 -0.1268749 -0.1088666 -0.0825252 -0.0942669 -0.0779933 0.0403702 -0.0007058 -0.1032323 -0.0178802 0.0351551 -0.0366034 0.138709 0.0626933 0.099933 -0.0243361 -0.0324013 0.0625828 -0.0433733 0.0686603 0.0909232 -0.0137836 0.0225046 0.0005104 0.06527 -0.0117294 0.0267254 0.0702451 -0.1401582 -0.0331587 0.1310005 0.0696851 0.0932241 -0.0283649 -0.0339794 0.0682483 -0.0523099 0.0662324 -0.0244315 -0.0953511 -0.0710133 -0.1122205 0.0544905 -0.0065861 -0.0520966 -0.0065836 0.0608436 0.0960888 -0.005683 0.0085142 0.0084162 0.0648031 -0.0179701 0.0016097 0.0679233 -0.1517517 0.0509757 -0.0378828 0.0305602 -0.0347034 0.1294749 0.0420316 -0.0436519 0.0249861 -0.1261878 0.000809 -0.0325315 0.0657537 -0.0368184 0.083426 0.0267926 -0.0237648 -0.0057405 -0.2928198 -0.0650954 -0.0780852 -0.078843 -0.0957995 0.180765 -0.0059168 -0.0957725 -0.0072102 0.033051 0.0947584 -0.0266778 -0.0424224 -0.0294092 0.162549 0.0251543 0.0011127 0.0386191 -0.1133676 unknown
polarizability: 100.2049948|9.122061|68.9062489|-5.0816069|-2.8893279|65.3907324 unknown
InChI: InChI=1S/C7H12O/c1-4-6(2)7(3)5-8/h4-7H,1H2,2-3H3
charge 0 multiplicity 1
20 atoms
O  -2.957439 -0.304197 0.210437
C  0.579346 -0.446415 -0.250151
C  -0.602456 0.447285 0.273406
C  0.282034 -1.952785 -0.018527
C  -0.37785 1.950747 -0.044994
C  1.879869 -0.064214 0.432817
C  -1.905763 0.022443 -0.388182
C  2.993849 0.398395 -0.187763
H  0.687887 -0.263912 -1.339822
H  -0.709362 0.305334 1.366333
H  -0.636909 -2.270824 -0.545133
H  1.119085 -2.574611 -0.381079
H  0.138822 -2.1646 1.057821
H  -1.186441 2.572549 0.378237
H  0.584166 2.288853 0.37713
H  -0.344476 2.124285 -1.137953
H  1.893029 -0.206838 1.526297
H  -1.87087 0.049751 -1.512428
H  3.907809 0.631455 0.37027
H  3.02577 0.551096 -1.274116
