program: Gaussian 09
title: 000110692
version: EM64L-G09RevD.01
frameworkgroup: C1[X(C9H10O4)]
method: RPBEPBE
basis: SDD
operation: Freq
keyword: #pfreq=noraman
keyword: PBEPBE/SDD
title: #p freq=noraman PBEPBE/SDD
converged: YES YES NO NO
title: Mulliken charges:
elementType: O O O O C C C C C C C C C H H H H H H H H H H
charge: -0.454404 -0.448090 -0.477839 -0.180788 0.006534 0.399084 -0.398153 -0.394265 -0.367341 0.193077 -0.215217 -0.239313 -0.237432 0.215577 0.259630 0.284780 0.227123 0.369271 0.228169 0.226652 0.229298 0.381903 0.391743
chargesum: 0.00000
title: Mulliken charges with hydrogens summed into heavy atoms:
elementType: O O O O C C C C C C C C C
charge: -0.085133 -0.066187 -0.086096 -0.180788 0.006534 0.399084 0.077055 -0.109484 -0.140218 0.193077 0.012952 -0.012662 -0.008134
polarizability: 1.41446884e+02 1.24293707e+00 9.63102698e+01 -2.24093148e+00 1.52266511e+01 7.91742975e+01
1716.lowfreq: -11.7033 -9.7451 0.0007 0.0008 0.0009 9.6259 34.4569 48.9732 92.6556
frequency: 34.1574 48.9652 92.6428 141.4026 187.1550 206.3478 253.7638 283.8895 327.7694 330.5790 379.9961 397.7026 402.3098 508.8043 527.2587 578.0994 587.0852 615.8193 644.6818 677.1969 703.2400 709.9529 733.5169 765.0309 850.4622 854.0195 915.8749 924.2975 960.2341 980.3555 990.3131 1001.0349 1016.6480 1030.4417 1040.6272 1066.2632 1092.7614 1169.5556 1173.3724 1189.1666 1212.8328 1265.0226 1316.6725 1327.0614 1360.0437 1381.5634 1386.4471 1435.2679 1448.7495 1484.0531 1594.4058 1615.3356 1682.4090 3002.0721 3105.5191 3121.3743 3130.5662 3144.5947 3161.4046 3178.4140 3384.0576 3469.5903 3516.0465
redmass: 4.3640 9.8463 5.4170 4.3906 4.3473 4.7197 4.4598 5.5077 4.1132 6.1287 6.4088 5.4747 2.8541 2.4713 1.2872 1.9484 1.7369 6.3615 3.4777 2.3552 2.0096 4.0452 1.6768 1.8847 3.3052 1.2630 2.3557 1.9278 4.1643 1.3816 5.9093 1.3549 3.6577 2.2115 5.0386 1.9375 1.6303 1.3069 1.0884 1.1187 1.9150 1.8264 1.3486 1.3439 1.5178 1.7232 2.5929 2.2082 1.0755 2.3293 6.2827 6.1140 9.8037 1.0645 1.1011 1.0863 1.0881 1.0935 1.0987 1.0960 1.0645 1.0647 1.0642
irintensity: 0.6526 2.5713 1.1139 2.8540 13.4121 2.3973 0.9242 6.5826 9.8391 0.7861 0.9193 5.6785 0.0745 33.4564 61.0781 94.7111 51.9552 1.0776 29.7087 57.3096 22.7550 41.8768 239.3023 30.4116 48.2709 2.1842 56.2963 49.9179 38.8154 1.1368 1.0517 3.4504 120.0737 30.4070 18.9452 154.4438 35.2305 11.5863 2.4285 2.4282 38.4309 1.0641 1.5415 12.7767 58.6493 34.7125 25.2272 19.4232 6.1681 14.0827 0.3149 1.2518 198.4627 28.5055 10.3459 7.0635 4.7252 32.3895 22.7456 6.9764 71.0627 67.5144 24.2211
temp: 298.150 k
press: 1.00000 atm
elementType: 8 8 8 8 6 6 6 6 6 6 6 6 6 1 1 1 1 1 1 1 1 1 1
symmnumber: 1
zpe: 461257.9 jmol-1
zpe.correction: 0.175684 hartree
zpe.thermalcorrener: 0.187678 hartree
zpe.thermalcorrenthalpy: 0.188622 hartree
zpe.thermalcorrgfe: 0.136986 hartree
zpe.sumelectzpe: -648.874612 hartree
zpe.sumelectthermal: -648.862618 hartree
zpe.sumelectthermalent: -648.861673 hartree
zpe.sumelectthermalfe: -648.913309 hartree
dipole: -1.0737 0.8353 1.9590
dipole: 2.3850
quadrupole: -60.9289 -78.7063 -78.4916
quadrupole: -8.4976 1.7419 6.8615
quadrupole: 11.7800 -5.9974 -5.7827 -8.4976 1.7419 6.8615
hfenergy: -649.0502954 hartree
pointgroup: C01 [X(C9H10O4)]
dipole: -0.3243086 0.6787765 -0.5608477 debye
dipolederiv: -0.5515934 -0.1541439 0.0558174 -0.1981939 -0.5188116 0.0376391 0.0685667 -0.0335643 -0.6339933 -0.957184 0.1574409 0.1001943 0.2154507 -0.6658091 0.0088314 0.1172494 0.0192439 -0.2986058 -1.2824907 0.2519402 -0.1206411 0.1792821 -0.4664892 0.0343945 -0.2411442 0.0659351 -0.4027629 -0.6685607 0.1040772 -0.0544029 0.2120682 -0.5111319 -0.290363 0.1613975 -0.3558672 -0.6410037 0.3954116 0.1434246 -0.004673 0.3072907 0.2312563 -0.0514336 -0.0389955 -0.0571812 0.3289499 0.2079957 -0.0408489 0.0248022 0.0080941 -0.0859983 -0.0269223 -0.0206432 -0.0215303 -0.0790935 0.5869565 -0.0397176 -0.092538 -0.2404888 0.2915378 0.0273734 -0.0871066 -0.0305672 0.1632078 -0.1250934 0.0453713 -0.0784839 0.0308355 -0.0857009 -0.0685045 -0.0040267 -0.0433026 -0.0293719 -0.0688794 -0.0093165 0.0761239 0.0180149 -0.1076107 -0.0209112 0.0668389 -0.0584334 0.0301861 1.4313705 -0.401561 0.1486784 -0.4197879 0.5107166 0.3586306 0.147536 0.4666255 0.8038349 -0.0066716 -0.0383209 0.0951832 -0.0409312 -0.0976846 -0.0966418 0.0701956 -0.0985394 0.0510514 -0.0110348 0.0319471 -0.0814265 0.0368866 -0.1071615 -0.0843827 -0.0945185 -0.0917191 0.0313129 0.0911897 0.0145971 0.0014736 0.0009865 -0.1420893 -0.0422445 0.0176581 -0.0359398 -0.0735373 0.0093985 -0.0138316 0.0540758 -0.0153706 0.0019739 0.0774301 0.0731981 0.1246473 -0.0613824 0.0220042 -0.0235323 -0.034866 -0.0582021 0.0592714 -0.0362748 -0.0805126 -0.0674601 -0.0182688 0.1185341 -0.0306195 0.0610736 -0.0214318 0.123091 0.052859 0.0554425 0.0519879 0.0449626 0.0287481 0.0401103 -0.0955402 0.0441225 0.1053414 0.0596899 -0.0964758 0.0675223 -0.0171614 0.2272002 0.0225638 -0.0073482 0.0544891 0.3859208 -0.037245 -0.0269982 0.0018172 0.3335361 0.0172168 0.0349538 -0.0793261 0.0378495 0.1115828 0.0902492 -0.0946945 0.090519 -0.032615 0.0148586 -0.041378 0.0744117 -0.0497528 0.112083 0.0875057 0.0908 0.0899554 -0.0239744 -0.1397474 -0.0063382 -0.0092121 -0.006067 0.146642 0.0272145 -0.0070371 0.0270022 0.1039904 0.3344011 -0.0756994 -0.043221 -0.0915696 0.426261 0.0372635 -0.0341518 0.0237122 0.2279502 0.3259699 0.0288815 0.0098449 -0.0035746 0.282809 -0.1441573 -0.0425782 -0.1348636 0.1927882 unknown
polarizability: 140.7313487|-4.8674491|73.0966541|3.4689452|-9.4363088|103.1034484 unknown
InChI: InChI=1S/C9H10O4/c10-6-9(13,8(11)12)7-4-2-1-3-5-7/h1-5,10-11,13H,6H2
charge 0 multiplicity 1
23 atoms
O  -1.422653 -0.859109 1.125143
O  -2.793184 1.448164 0.737458
O  -2.829195 -0.17507 -1.427632
O  -0.933102 -1.332965 -2.091422
C  -0.888791 -0.009646 0.054135
C  0.636294 -0.052957 0.058267
C  -1.386427 1.453144 0.319524
C  1.324956 -0.574164 1.178205
C  1.371655 0.498135 -1.020712
C  -1.473686 -0.580767 -1.266139
C  2.736851 -0.54161 1.219951
C  2.7822 0.533503 -0.974855
C  3.469758 0.014933 0.146955
H  -1.217969 2.097076 -0.565229
H  -0.828302 1.856871 1.178527
H  0.743992 -1.011576 1.994536
H  0.85385 0.880718 -1.908367
H  -2.258722 -0.401402 1.435268
H  3.263472 -0.954505 2.087651
H  3.343653 0.956548 -1.815216
H  4.564778 0.03834 0.179975
H  -3.328686 1.134836 -0.043174
H  -3.21454 -0.626097 -2.226346
