program: Gaussian 09
title: 000001058
version: EM64L-G09RevD.01
frameworkgroup: C1[X(H3O7P2)]
method: RPBEPBE
basis: SDD
operation: Freq
keyword: #p
keyword: freq=noraman
keyword: PBEPBE/SDD
title: #p freq=noraman PBEPBE/SDD
converged: YES YES NO NO
title: Mulliken charges:
elementType: P P O O O O O O O H H H
charge: 1.342142 1.390437 -0.743171 -0.728419 -0.749269 -0.714725 -0.666042 -0.644473 -0.708012 0.420005 0.376106 0.425421
chargesum: -1.00000
title: Mulliken charges with hydrogens summed into heavy atoms:
elementType: P P O O O O O O O
charge: 1.342142 1.390437 -0.743171 -0.728419 -0.373163 -0.289304 -0.666042 -0.644473 -0.288007
polarizability: 9.47355361e+01 -2.18235148e+00 6.07795196e+01 -1.59297401e+00 2.03016836e+00 5.59306361e+01
1716.lowfreq: -8.0429 -0.0014 -0.0013 0.0013 5.4598 7.6027 66.4837 140.9575 176.1841
frequency: 66.4464 140.9492 176.1833 204.1467 237.7130 245.7380 273.2634 302.7703 305.6523 337.1886 346.1786 371.5985 391.8013 446.8032 545.2370 570.1468 648.2520 694.3847 759.4561 791.9397 878.2055 883.4628 967.9208 1067.6246 1099.0988 1298.1720 1387.7643 2613.6476 3028.9070 3611.3095
redmass: 9.7241 11.4509 10.0453 14.7844 8.7312 7.2524 2.0914 4.4027 2.8853 8.3735 15.1533 10.5822 12.5865 10.1124 10.8599 15.2738 15.5727 14.1013 1.6450 3.3738 7.3134 1.1179 1.3344 10.9189 4.8473 1.0899 1.1551 1.0734 1.0691 1.0657
irintensity: 3.4446 2.8014 7.1184 2.0895 3.0213 0.8226 62.5305 9.4116 26.5427 3.7174 12.5215 83.1475 42.0575 20.9791 31.1145 149.1905 263.0987 114.5833 38.4124 136.0509 289.2090 236.8719 69.8147 145.0581 244.1880 96.1483 267.1935 624.5022 485.1750 22.6524
temp: 298.150 k
press: 1.00000 atm
elementType: 15 15 8 8 8 8 8 8 8 1 1 1
symmnumber: 1
zpe: 147690.7 jmol-1
zpe.correction: 0.056252 hartree
zpe.thermalcorrener: 0.066665 hartree
zpe.thermalcorrenthalpy: 0.067609 hartree
zpe.thermalcorrgfe: 0.020674 hartree
zpe.sumelectzpe: -1210.207000 hartree
zpe.sumelectthermal: -1210.196588 hartree
zpe.sumelectthermalent: -1210.195643 hartree
zpe.sumelectthermalfe: -1210.242578 hartree
dipole: -2.1910 2.8132 -1.4381
dipole: 3.8448
quadrupole: -102.5069 -71.7264 -81.3375
quadrupole: -6.8926 0.9412 -1.9099
quadrupole: -17.3166 13.4638 3.8528 -6.8926 0.9412 -1.9099
hfenergy: -1210.2632521 hartree
pointgroup: C01 [X(H3O7P2)]
dipole: -0.8157073 0.4744258 1.1822426 debye
dipolederiv: 2.2374311 0.0852195 0.0313973 -0.2835014 1.4126651 0.0987416 -0.0322334 0.0476608 1.8879851 2.3299012 -0.1576512 -0.0197825 0.2335736 1.5253127 0.0527006 -0.0061802 0.0444064 1.8525594 -1.9152246 -0.0489212 0.010814 -0.0284908 -0.6799258 0.0185594 -0.0075512 0.0349595 -0.685918 -0.988426 -0.1041359 0.0785608 -0.0159733 -0.7496791 0.1615719 0.0650294 0.1024954 -0.774706 -0.8217865 0.0600577 -0.0514821 0.1521883 -0.674465 -0.3304151 -0.0252186 -0.2767906 -1.0512277 -0.8311086 0.1246834 0.1553905 0.0186148 -0.7699325 -0.1738359 0.0678661 -0.1345923 -0.95582 -0.8717238 -0.1147227 -0.0465001 -0.1116319 -0.6660893 -0.0327878 0.0696062 0.057553 -0.6689403 -0.8388847 0.0647142 0.0161652 0.0249045 -0.5751915 -0.0091972 0.0011928 -0.0045433 -0.6262371 -1.0430021 0.0920341 -0.0728721 0.0741223 -0.7627694 0.1368299 -0.1046671 0.0925116 -0.8427558 0.8680753 0.0942631 -0.0782003 0.0308192 0.3334089 0.0163217 -0.0571752 0.0272225 0.3387884 0.2453096 -0.1148243 0.0483765 -0.1359344 0.2616929 0.077307 0.0399721 0.0506231 0.2146282 0.6294393 0.0192831 -0.0718671 0.0413091 0.3449729 -0.0157963 -0.010641 -0.0415061 0.3116438 unknown
polarizability: 93.9919274|3.7927011|56.4140022|-4.1932951|-2.5729581|61.0397621 unknown
InChI: InChI=1S/H3O7P2/c1-8(2,3)7-9(4,5)6/h1-2,4H
charge -1 multiplicity 1
12 atoms
P  -1.715283 -0.182438 -0.173903
P  1.347806 -0.029392 -0.202343
O  -0.124796 -1.010992 -0.12716
O  -1.558947 0.949801 -1.320085
O  -1.483796 0.706842 1.392987
O  1.191243 0.902815 1.233185
O  -2.919182 -1.207726 0.001443
O  2.698334 -0.841363 -0.284546
O  1.040852 0.998831 -1.525196
H  0.007802 1.141824 -1.637761
H  -2.006759 0.289587 2.121763
H  0.211028 0.992013 1.510816
