program: Gaussian 09
title: 000110690
version: EM64L-G09RevD.01
frameworkgroup: C1[X(C15H17N)]
method: RPBEPBE
basis: SDD
operation: Freq
keyword: #pfreq=noraman
keyword: PBEPBE/SDD
title: #p freq=noraman PBEPBE/SDD
converged: YES YES NO NO
title: Mulliken charges:
elementType: N C C C C C C C C C C C C C C C H H H H H H H H H H H H H H H H H
charge: -0.552416 -0.306649 -0.420797 -0.559099 0.525131 0.507672 -0.444259 -0.407677 -0.407013 -0.419299 -0.225071 -0.237349 -0.230205 -0.227118 -0.245509 -0.244758 0.215317 0.206047 0.244215 0.230212 0.197016 0.264867 0.266929 0.232355 0.225569 0.231286 0.234017 0.225204 0.223523 0.222050 0.221836 0.228137 0.225840
chargesum: 0.00000
title: Mulliken charges with hydrogens summed into heavy atoms:
elementType: N C C C C C C C C C C C C C C C
charge: -0.020620 -0.091333 0.029465 -0.131871 0.525131 0.507672 -0.211904 -0.182108 -0.175727 -0.185282 0.000132 -0.013826 -0.008156 -0.005283 -0.017372 -0.018918
polarizability: 1.94072536e+02 -2.08965383e+01 1.53966849e+02 1.29873206e+01 1.75191618e+01 1.32320637e+02
1716.lowfreq: -10.7370 -6.7136 -3.9263 -0.0005 -0.0005 0.0004 22.2953 22.7313 29.7682
frequency: 21.7802 22.2607 29.0880 58.6723 78.0866 150.3218 175.8177 205.5433 231.8206 251.4930 320.5963 337.3049 361.8508 400.1822 404.0421 454.2439 523.5459 537.0523 575.5289 587.3575 615.6985 618.1583 657.5790 705.0750 706.0623 739.4276 760.2005 777.6008 809.2534 813.2045 850.1206 853.9426 912.8117 916.9582 966.8933 972.9545 975.1576 988.5444 989.8209 992.3719 993.0411 999.1011 1024.5501 1025.8870 1034.8602 1068.4997 1082.0398 1101.7409 1125.6370 1170.9664 1171.2810 1184.9539 1186.8912 1191.4024 1192.5791 1217.4232 1265.3107 1283.3064 1296.3530 1327.6877 1332.1772 1340.5616 1354.4619 1382.6053 1385.9172 1440.7840 1441.0279 1467.9662 1477.9534 1483.5676 1486.1686 1591.2238 1593.2053 1608.3690 1614.6181 1637.8780 2967.2631 2978.1839 2985.8067 3030.8201 3056.4710 3105.5062 3111.7628 3113.1479 3113.4041 3128.8408 3129.9135 3140.2697 3141.4147 3160.5386 3160.6847 3426.7227 3553.2813
redmass: 3.8113 3.7249 4.4431 3.6695 4.1394 2.6687 3.3245 2.9348 1.9915 1.6808 3.6736 2.4928 3.6589 2.7878 2.8195 3.6099 3.3625 3.0227 2.2544 3.7309 6.2820 6.3515 1.8631 1.7461 1.6809 2.0566 1.9178 2.2556 1.7582 2.7364 1.2512 1.2484 1.4550 1.4556 2.0731 1.4648 1.3903 4.7806 6.1913 1.3199 1.3156 1.9171 2.3586 2.2187 3.0431 1.6153 1.5703 2.4429 1.3470 1.0669 1.0523 1.1612 1.1197 1.4412 2.0989 2.3722 1.2718 1.5338 1.3428 1.2517 1.3919 1.4112 1.3668 7.8128 4.8998 2.1655 2.1246 1.1090 2.1853 2.1062 1.1524 5.9296 6.0434 6.0576 6.1661 1.0920 1.0678 1.0719 1.0675 1.0978 1.1019 1.0872 1.0870 1.0856 1.0881 1.0897 1.0908 1.0953 1.0958 1.1013 1.1013 1.0447 1.0966
irintensity: 0.0107 0.1307 0.0334 0.1617 0.3769 0.2754 4.5800 2.9278 16.6739 39.5470 4.6486 0.5071 0.7968 0.8281 0.0004 5.9775 30.9391 17.8733 34.6630 21.9150 0.1628 0.1062 245.7649 65.7977 41.9985 15.2023 33.1739 41.2083 10.1980 12.5421 0.5244 0.1119 2.4860 3.7736 1.1821 0.7046 0.0567 0.5403 0.0080 0.0861 0.2436 18.0359 1.9740 1.7150 11.9687 2.6399 12.9092 4.6042 2.9238 0.1003 0.1765 0.8524 0.1788 9.8944 6.5918 0.0944 1.0806 9.1852 9.2431 1.0622 6.3052 0.7482 2.6834 0.2391 1.2148 3.7021 14.2229 2.0223 8.1854 26.5419 5.9189 1.0857 1.2828 5.9658 12.4125 35.6409 2.3754 7.8411 67.8788 1.1185 44.4705 11.3574 8.6201 12.5976 4.6063 4.7704 11.3047 41.3531 49.2897 41.4327 12.4659 4.5140 0.0718
temp: 298.150 k
press: 1.00000 atm
elementType: 7 6 6 6 6 6 6 6 6 6 6 6 6 6 6 6 1 1 1 1 1 1 1 1 1 1 1 1 1 1 1 1 1
symmnumber: 1
zpe: 731124.4 jmol-1
zpe.correction: 0.278471 hartree
zpe.thermalcorrener: 0.293185 hartree
zpe.thermalcorrenthalpy: 0.294129 hartree
zpe.thermalcorrgfe: 0.233834 hartree
zpe.sumelectzpe: -635.387348 hartree
zpe.sumelectthermal: -635.372634 hartree
zpe.sumelectthermalent: -635.371690 hartree
zpe.sumelectthermalfe: -635.431984 hartree
dipole: 1.1584 -0.5921 -0.3538
dipole: 1.3482
quadrupole: -89.5236 -96.4840 -90.5084
quadrupole: -2.2105 0.7436 5.2037
quadrupole: 2.6484 -4.3120 1.6636 -2.2105 0.7436 5.2037
hfenergy: -635.6658184 hartree
pointgroup: C01 [X(C15H17N1)]
dipole: 0.4475572 -0.2571449 -0.1221271 debye
polarizability: 194.3295787|-19.2067972|158.8047436|13.7241196|14.4808331|127.2256999 unknown
InChI: InChI=1S/C15H17N/c16-15(14-9-5-2-6-10-14)12-11-13-7-3-1-4-8-13/h1-10,15H,11-12,16H2
charge 0 multiplicity 1
33 atoms
N  1.723458 2.507282 -1.455405
C  1.343077 1.629063 -0.319764
C  -0.1303 1.189257 -0.518132
C  -0.722754 0.425256 0.695867
C  2.289224 0.432627 -0.108554
C  -2.176466 0.035779 0.469618
C  2.989577 0.269605 1.112582
C  2.500662 -0.520696 -1.140268
C  -3.228011 0.939207 0.773818
C  -2.512602 -1.224781 -0.088886
C  3.879777 -0.813351 1.303928
C  3.383993 -1.605557 -0.954123
C  -4.57629 0.595924 0.526689
C  -3.859393 -1.573447 -0.339205
C  4.0795 -1.755908 0.270326
C  -4.897347 -0.663093 -0.03236
H  1.381997 2.25297 0.596526
H  -0.21015 0.550385 -1.422356
H  -0.726452 2.099879 -0.716036
H  -0.112495 -0.477061 0.889126
H  -0.637996 1.070396 1.593016
H  1.537338 2.082722 -2.372284
H  2.690835 2.847132 -1.398432
H  2.838001 0.998054 1.919735
H  1.972126 -0.413523 -2.096695
H  -2.986824 1.916365 1.211648
H  -1.711878 -1.938238 -0.322105
H  4.414549 -0.920464 2.254693
H  3.534051 -2.333603 -1.759971
H  -5.374797 1.305529 0.77262
H  -4.099588 -2.553665 -0.767197
H  4.76808 -2.596184 0.413696
H  -5.9425 -0.932761 -0.222016
