program: Gaussian 09
title: 000110688
version: EM64L-G09RevD.01
frameworkgroup: C1[X(C7H13N)]
method: RPBEPBE
basis: SDD
operation: Freq
keyword: #pfreq=noraman
keyword: PBEPBE/SDD
title: #p freq=noraman PBEPBE/SDD
converged: NO YES NO NO
title: Mulliken charges:
elementType: N C C C C C C C H H H H H H H H H H H H H
charge: -0.307362 -0.113965 -0.113980 -0.481222 -0.481213 -0.419833 -0.453754 -0.453750 0.244122 0.244128 0.203009 0.220638 0.220640 0.203006 0.223848 0.196593 0.222942 0.184166 0.184163 0.222945 0.254878
chargesum: 0.00000
title: Mulliken charges with hydrogens summed into heavy atoms:
elementType: N C C C C C C C
charge: -0.052484 0.130158 0.130148 -0.057575 -0.057567 0.000609 -0.046646 -0.046642
polarizability: 8.27776392e+01 -2.36650349e-04 7.87429118e+01 7.85119431e-01 1.40474188e-04 6.65833469e+01
1716.lowfreq: -31.6916 -24.5180 -7.3872 0.0002 0.0004 0.0005 92.8287 183.1437 275.5113
frequency: 92.1698 183.1404 275.5040 345.3164 375.0493 510.6580 542.7910 568.4719 685.2826 702.2207 796.2725 807.5153 859.1283 902.1117 916.2999 935.2576 963.6885 976.1673 1003.9070 1024.5508 1054.8934 1063.6800 1098.5213 1124.1151 1136.2210 1163.7230 1179.8683 1182.5367 1219.3172 1237.5994 1245.7928 1278.7695 1293.7909 1295.9523 1303.2138 1314.1775 1325.0078 1350.5749 1396.6241 1460.8917 1463.5191 1475.5406 1475.7571 1489.6561 2845.7767 2854.1396 2983.4616 2986.3817 2988.3330 3020.4652 3028.9193 3037.3041 3046.4593 3048.0503 3053.4907 3067.3731 3450.6237
redmass: 2.2433 2.4443 1.8661 2.1098 1.8049 1.9073 4.1060 1.8874 2.7218 2.2746 1.7070 2.9598 2.2249 2.4900 1.8103 2.0321 2.1061 1.6979 1.4825 1.5312 1.8776 1.4653 1.9538 3.4787 1.2844 1.8302 1.3984 1.4420 1.3694 1.1698 1.3659 1.3628 1.3175 1.4196 1.2935 1.3693 1.4778 1.4255 1.4052 1.0882 1.0857 1.0997 1.0775 1.0944 1.0714 1.0708 1.0612 1.0607 1.0647 1.0854 1.0883 1.0899 1.0980 1.1017 1.0943 1.1013 1.0756
irintensity: 0.3644 1.0856 2.8869 0.0005 1.3847 89.4273 0.4200 22.6698 0.5053 51.7362 0.2951 21.4908 4.4955 0.7019 10.5567 6.1850 2.2331 4.6037 0.2122 1.0351 0.8538 0.5340 2.7950 0.3166 7.3350 0.9898 0.6882 3.3951 0.6511 11.0848 1.8524 4.0201 1.2885 1.7283 3.7528 0.6474 5.1250 1.5999 4.7340 9.7116 6.7202 11.9586 0.3187 11.4489 67.2847 148.8539 34.2699 50.9351 27.7147 0.5701 15.4207 113.5111 30.4055 2.5097 65.8237 105.2855 2.7306
temp: 298.150 k
press: 1.00000 atm
elementType: 7 6 6 6 6 6 6 6 1 1 1 1 1 1 1 1 1 1 1 1 1
symmnumber: 1
zpe: 499476.9 jmol-1
zpe.correction: 0.190241 hartree
zpe.thermalcorrener: 0.197244 hartree
zpe.thermalcorrenthalpy: 0.198188 hartree
zpe.thermalcorrgfe: 0.159173 hartree
zpe.sumelectzpe: -328.634145 hartree
zpe.sumelectthermal: -328.627142 hartree
zpe.sumelectthermalent: -328.626198 hartree
zpe.sumelectthermalfe: -328.665213 hartree
dipole: 0.4912 0.0001 -0.8838
dipole: 1.0111
quadrupole: -50.9931 -49.3249 -49.7373
quadrupole: -0.0001 3.8876 0.0002
quadrupole: -0.9747 0.6935 0.2811 -0.0001 3.8876 0.0002
hfenergy: -328.8243859 hartree
pointgroup: C01 [X(C7H13N1)]
dipole: 0.2020823 0.0000354 -0.342649 debye
dipolederiv: -0.6003141 -0.0000158 0.2267015 -0.0000063 -0.4812287 0.0000166 0.2084626 0.0000155 -0.3549382 0.0194379 -0.0224867 -0.0278955 0.0436054 0.0045207 0.043466 -0.0370114 0.0388138 0.1155408 0.0194474 0.0225035 -0.0278983 -0.0435998 0.0045383 -0.0434695 -0.0370077 -0.0388141 0.11553 0.0632283 0.0265246 0.0652985 -0.0407766 0.0444742 -0.0391217 0.0756428 -0.0179379 0.0903359 0.0632218 -0.0265173 0.0652917 0.0407869 0.0444847 0.0391395 0.0756403 0.0179527 0.0903369 0.0765041 0.0000084 0.0659917 0.000003 0.0154763 0.0000063 0.0165255 0.0000029 0.0755831 0.2556815 0.1523416 -0.1583049 0.131316 0.3590396 -0.0020045 -0.1002726 0.0139262 0.2768011 0.2557535 -0.1523629 -0.1583317 -0.1313365 0.3589808 0.0019774 -0.1002905 -0.0139409 0.27679 0.0100143 0.0307555 0.0396368 0.0089204 0.0095179 -0.0687777 0.0335807 -0.0879871 -0.1471001 0.0100168 -0.0307664 0.0396489 -0.00893 0.0095119 0.0687808 0.0335812 0.0879889 -0.1470916 -0.0802811 -0.0414347 -0.109322 0.007881 0.0643971 -0.0163569 -0.1264802 -0.0691021 -0.0905044 0.0685463 0.0219269 -0.0096468 -0.0140379 -0.1541042 0.0815335 0.0312315 0.1243638 0.0172234 0.0685471 -0.0218839 -0.0096275 0.0140799 -0.1541245 -0.0815231 0.0312534 -0.1243467 0.0172433 -0.0802797 0.0414006 -0.1093288 -0.0079165 0.0644102 0.0163252 -0.1264925 0.0690696 -0.0905189 -0.2129513 -0.0000192 0.0930092 -0.0000214 0.0648283 0.0000077 0.0576312 0.0000047 0.0617591 0.0479482 -0.0000014 -0.1409178 0.000004 0.0205114 -0.0000155 -0.0903655 -0.0000119 -0.1336444 -0.0062799 0.1039976 0.0189897 0.0893792 -0.1579521 -0.034452 0.0537581 -0.0624331 0.062421 -0.0563493 -0.1176184 0.1247338 -0.0558901 -0.0316488 0.0246276 0.1196435 0.1219355 -0.2132372 -0.0563919 0.1176103 0.1247562 0.0558801 -0.031604 -0.0245834 0.1196866 -0.1218911 -0.2132462 -0.0062443 -0.1039717 0.0189736 -0.0893563 -0.1579953 0.034435 0.0537383 0.0624183 0.0624329 0.1407443 0.0000096 -0.1317584 0.0000155 0.1039662 -0.0000112 -0.2924553 -0.0000271 0.1282835 unknown
polarizability: 82.7268698|-0.0000488|78.7429118|1.1983362|0.0002766|66.6341163 unknown
InChI: InChI=1S/C7H13N/c1-2-6-4-8-5-7(6)3-1/h6-8H,1-5H2
charge 0 multiplicity 1
21 atoms
N  -2.100913 -0.00015 -0.221089
C  -0.025606 0.791489 0.642552
C  -0.025498 -0.791463 0.64255
C  1.374315 1.213382 0.112803
C  1.374499 -1.213167 0.112879
C  1.848484 0.000114 -0.72965
C  -1.208102 1.18266 -0.291641
C  -1.207879 -1.182778 -0.291724
H  -0.213942 1.185896 1.655855
H  -0.213873 -1.1859 1.655833
H  2.072085 1.366118 0.959085
H  1.341437 2.156192 -0.464604
H  1.341796 -2.156032 -0.464448
H  2.072268 -1.365712 0.959198
H  2.937116 0.000196 -0.918432
H  1.339501 0.000049 -1.714681
H  -1.737399 2.092291 0.044216
H  -0.811448 1.373979 -1.321246
H  -0.811144 -1.373923 -1.321332
H  -1.737008 -2.092546 0.044028
H  -2.876191 -0.000195 -0.897452
