program: Gaussian 09
title: 000110687
version: EM64L-G09RevD.01
frameworkgroup: C1[X(C5HCl5O)]
method: RPBEPBE
basis: SDD
operation: Freq
keyword: #p
keyword: freq=noraman
keyword: PBEPBE/SDD
title: #p freq=noraman PBEPBE/SDD
converged: YES YES NO NO
title: Mulliken charges:
elementType: Cl Cl Cl Cl Cl O C C C C C H
charge: 0.088929 0.111519 0.067403 0.117602 0.093828 -0.120609 -0.486291 -0.473764 0.119980 0.299768 -0.167644 0.349280
chargesum: 0.00000
title: Mulliken charges with hydrogens summed into heavy atoms:
elementType: Cl Cl Cl Cl Cl O C C C C C
charge: 0.088929 0.111519 0.067403 0.117602 0.093828 -0.120609 -0.486291 -0.124484 0.119980 0.299768 -0.167644
polarizability: 1.21687292e+02 -3.41253740e+00 1.26174818e+02 1.43620430e+00 9.50849217e-01 7.13267898e+01
1716.lowfreq: -7.8688 -4.1757 -0.0037 -0.0026 -0.0010 3.2865 32.6327 71.9221 126.1626
frequency: 32.6062 71.9204 126.1623 149.9039 159.0799 164.6214 180.6476 224.9097 264.4152 309.6531 323.4378 345.4022 429.9749 482.2995 528.4835 617.7898 642.8008 716.7443 735.9304 807.7004 863.8534 951.7622 1035.3122 1144.7711 1175.7851 1196.3422 1226.0017 1569.2878 1668.2544 3069.6368
redmass: 23.8465 23.0231 30.0041 23.2509 31.4739 25.4525 30.3990 24.3781 17.6448 24.0244 14.3148 28.7302 17.8320 8.5553 10.4681 9.9749 8.4361 9.7606 12.6752 7.3818 12.1720 7.4788 7.9898 6.4385 8.6243 1.2935 1.2459 11.9874 13.0522 1.0843
irintensity: 1.0166 0.3699 0.0780 1.3368 0.2047 0.5668 0.0986 1.0574 2.2920 1.2313 0.9622 0.9009 8.3360 20.6155 21.7517 32.3793 73.0026 38.7741 86.9346 39.4144 6.6247 30.1529 18.6553 39.8502 96.2003 33.5736 21.3645 132.2405 190.7064 5.5452
temp: 298.150 k
press: 1.00000 atm
elementType: 17 17 17 17 17 8 6 6 6 6 6 1
symmnumber: 1
zpe: 126896.8 jmol-1
zpe.correction: 0.048332 hartree
zpe.thermalcorrener: 0.059657 hartree
zpe.thermalcorrenthalpy: 0.060602 hartree
zpe.thermalcorrgfe: 0.008673 hartree
zpe.sumelectzpe: -2565.806681 hartree
zpe.sumelectthermal: -2565.795356 hartree
zpe.sumelectthermalent: -2565.794412 hartree
zpe.sumelectthermalfe: -2565.846341 hartree
dipole: -0.9978 -1.8643 -0.9185
dipole: 2.3054
quadrupole: -97.1817 -106.9123 -93.6146
quadrupole: 2.0330 -1.0213 -0.5846
quadrupole: 2.0545 -7.6761 5.6216 2.0330 -1.0213 -0.5846
hfenergy: -2565.8550138 hartree
pointgroup: C01 [X(C5H1Cl5O1)]
dipole: 0.0883993 -0.8144754 0.3892411 debye
dipolederiv: -0.4022706 -0.1740101 0.2304478 -0.1672781 -0.2166445 0.1776806 0.2472914 0.1669242 -0.4431757 -0.3521085 -0.0724665 -0.1960558 -0.0384547 -0.0832229 -0.050791 -0.249669 -0.0461627 -0.5483961 -0.2366747 0.1796207 -0.0403696 0.1829368 -0.2856963 0.0631765 -0.0862919 0.1147827 -0.0918317 -0.0360819 0.1288255 0.0035566 0.0860671 -0.741605 -0.0588631 0.0029589 -0.1048913 0.0481638 -0.7551133 0.0418425 0.0286573 0.163901 -0.0152907 -0.010026 0.0760335 -0.0091536 0.0588375 -0.5145762 -0.273374 0.0073793 -0.2837584 -0.935779 -0.0493081 0.0198116 -0.0285493 -0.2598109 0.9469606 0.4011865 -0.0644141 0.2012802 0.155115 -0.2268942 -0.1159362 -0.1149694 1.1829055 -0.0563635 -0.3464361 0.1450067 -0.297515 0.3678424 -0.0493691 0.2656583 -0.2371856 0.0466999 -0.305725 0.0101756 0.0321955 -0.0397879 1.2060255 0.1334977 0.1224507 0.1696922 -0.1451455 0.5951246 0.0062719 -0.0800355 0.3102778 1.3676999 0.1463019 -0.1396509 0.1517017 0.1739267 1.091393 0.0524167 -0.0561932 -0.1295242 -0.8558253 -0.0883016 -0.1066481 -0.103542 -0.0490335 0.0254354 0.0459473 -0.0101748 0.0118553 0.037381 0.0128965 -0.0360082 0.0413531 0.0268602 unknown
polarizability: 124.6874602|4.0482428|123.0168695|0.916263|-3.1626518|71.4845694 unknown
InChI: InChI=1S/C5HCl5O/c6-1-2(11)4(8)5(9,10)3(1)7/h4H
charge 0 multiplicity 1
12 atoms
Cl -2.075907 -1.315136 1.360088
Cl -1.845665 -0.677454 -1.594708
Cl -1.816981 2.290907 -0.321786
Cl 0.607919 -2.818426 -0.178252
Cl 3.094969 -0.393566 -0.116399
O  1.366857 2.330115 0.144661
C  -1.010784 -0.467777 0.066406
C  -0.740613 1.013956 0.465909
C  0.368943 -1.078483 -0.003037
C  0.770512 1.237583 0.18105
C  1.352429 -0.125122 0.024313
H  -0.910779 1.123803 1.549655
