program: Gaussian 09
title: 000110685
version: EM64L-G09RevD.01
frameworkgroup: C1[X(C10H18O)]
method: RPBEPBE
basis: SDD
operation: Freq
keyword: #pfreq=noraman
keyword: PBEPBE/SDD
title: #p freq=noraman PBEPBE/SDD
converged: YES YES NO NO
title: Mulliken charges:
elementType: O C C C C C C C C C C H H H H H H H H H H H H H H H H H H
charge: -0.444493 0.305720 -0.168147 -0.277016 -0.744270 -0.741712 -0.389984 -0.258457 0.356429 -0.792750 -0.795374 0.243655 0.215211 0.206659 0.218146 0.209946 0.216220 0.212974 0.209971 0.191807 0.180985 0.190096 0.337135 0.212444 0.215578 0.226065 0.220559 0.215187 0.227416
chargesum: 0.00000
title: Mulliken charges with hydrogens summed into heavy atoms:
elementType: O C C C C C C C C C C
charge: -0.107358 0.305720 0.075508 -0.061805 -0.109519 -0.102547 -0.017191 -0.068362 0.356429 -0.138663 -0.132212
polarizability: 1.47746520e+02 -5.91096623e+00 1.05629420e+02 -2.91007741e+00 2.08126095e+00 9.56949665e+01
1716.lowfreq: -11.8318 0.0005 0.0005 0.0006 6.1842 15.9020 22.3559 63.2105 75.6807
frequency: 21.1173 63.1635 75.6742 100.9468 117.5422 146.1724 165.2211 173.7043 201.2349 214.9024 260.1231 279.6448 309.7472 313.1082 331.0434 374.5010 414.7639 444.8185 459.5056 510.7661 544.2944 671.6833 803.1196 820.6889 864.9874 885.1233 946.3762 949.5186 950.9103 961.5988 968.6837 994.9545 1005.4234 1036.4075 1051.3769 1079.0120 1085.5725 1103.8320 1126.1558 1171.4307 1186.8247 1214.5482 1231.4951 1261.3528 1289.3654 1320.0357 1365.4035 1381.9541 1387.2655 1394.1870 1398.7439 1402.1499 1442.3110 1454.3162 1464.5613 1465.4015 1467.2922 1470.9138 1472.1399 1476.7553 1483.2583 1488.1263 1689.7129 2925.7189 2952.5029 2960.8163 2964.1648 2970.2419 2981.1833 3021.9222 3026.9662 3048.0748 3053.3332 3071.5650 3073.4225 3078.8175 3084.4464 3091.6378 3099.5674 3108.6787 3551.3996
redmass: 3.1073 3.1234 2.4027 1.1877 2.6410 2.3120 1.2239 1.1721 1.5808 1.3366 1.3284 1.9823 2.6515 2.8259 2.6217 2.3132 2.7118 2.7843 2.5786 2.7541 2.8295 3.4199 2.7933 3.5386 1.4100 2.5251 1.6047 1.7409 1.7225 1.6874 1.7341 1.2459 1.5356 1.4197 1.5411 1.6529 1.6206 1.9886 1.8652 2.3802 1.4848 1.2636 1.8289 1.8422 1.5533 1.6098 1.4962 1.3330 1.2921 1.3469 1.2642 1.2841 1.9585 1.0509 1.0615 1.0515 1.0518 1.0469 1.0764 1.0898 1.0472 1.2113 6.4686 1.0573 1.0372 1.0388 1.0373 1.0367 1.1027 1.0968 1.0965 1.0985 1.0984 1.0982 1.0968 1.0931 1.0940 1.0952 1.0899 1.0865 1.0664
irintensity: 0.4905 2.2990 2.6922 0.0415 2.4082 1.3093 1.3502 1.7536 8.0189 1.3960 94.7856 34.3668 7.0008 2.3158 5.5213 1.2266 15.0073 1.2629 0.6021 1.6736 6.4046 3.5757 14.8567 0.9347 16.2742 1.6056 5.5950 17.1256 12.1525 29.7338 42.2029 4.6205 2.9750 3.8635 10.9853 2.4583 6.1997 27.2073 31.9225 33.7866 2.7680 19.0747 9.5886 7.2487 1.7202 0.5475 2.5573 15.1638 29.3686 7.8439 15.0190 7.8943 13.0590 1.3926 0.7595 13.6121 4.0160 21.9995 9.6999 1.7740 19.1162 1.0961 0.4690 78.1868 54.7161 73.7891 40.4212 50.7898 59.8956 17.6629 42.0115 12.1932 63.3280 29.9408 12.8744 28.3963 36.3889 24.7581 8.1957 58.3271 3.3821
temp: 298.150 k
press: 1.00000 atm
elementType: 8 6 6 6 6 6 6 6 6 6 6 1 1 1 1 1 1 1 1 1 1 1 1 1 1 1 1 1 1
symmnumber: 1
zpe: 665550.9 jmol-1
zpe.correction: 0.253495 hartree
zpe.thermalcorrener: 0.267949 hartree
zpe.thermalcorrenthalpy: 0.268893 hartree
zpe.thermalcorrgfe: 0.211946 hartree
zpe.sumelectzpe: -466.135249 hartree
zpe.sumelectthermal: -466.120795 hartree
zpe.sumelectthermalent: -466.119851 hartree
zpe.sumelectthermalfe: -466.176798 hartree
dipole: 1.5234 -0.5649 1.0563
dipole: 1.9379
quadrupole: -59.7960 -69.7551 -68.1217
quadrupole: 3.4493 1.2647 3.3874
quadrupole: 6.0949 -3.8642 -2.2308 3.4493 1.2647 3.3874
hfenergy: -466.3887438 hartree
pointgroup: C01 [X(C10H18O1)]
dipole: -0.556453 -0.4359319 -0.2857186 debye
polarizability: 145.0575353|10.4111379|105.2526736|-6.2549517|-5.9620856|98.7606976 unknown
InChI: InChI=1S/C10H18O/c1-7(2)5-8-9(6-11)10(8,3)4/h5,8-9,11H,6H2,1-4H3
charge 0 multiplicity 1
29 atoms
O  -2.327726 2.252503 -0.402668
C  -1.000453 -1.276431 0.394416
C  -1.411338 0.206664 0.463764
C  -0.064711 -0.176561 -0.201316
C  -1.684379 -2.226184 -0.591231
C  -0.610109 -1.96263 1.703515
C  -2.547265 0.791897 -0.341362
C  1.230977 0.205077 0.418568
C  2.4138 0.457153 -0.217767
C  3.649092 0.863581 0.569895
C  2.620756 0.377251 -1.720186
H  -1.326792 0.669645 1.455841
H  -0.088015 -0.132942 -1.297327
H  -1.895155 -1.748254 -1.564463
H  -1.035214 -3.101184 -0.785659
H  -2.642245 -2.604907 -0.182993
H  0.137823 -2.75829 1.522711
H  -0.179269 -1.256883 2.434553
H  -1.497381 -2.430027 2.173026
H  -3.518534 0.570541 0.155658
H  -2.573741 0.361444 -1.364608
H  1.220223 0.30755 1.514711
H  -3.11618 2.680398 -0.824086
H  4.48204 0.149998 0.405741
H  4.018154 1.858306 0.247308
H  3.447425 0.910771 1.654413
H  2.924394 1.363426 -2.125547
H  3.439044 -0.329791 -1.964084
H  1.720879 0.05138 -2.266322
