program: Gaussian 09
title: 000110671
version: EM64L-G09RevD.01
frameworkgroup: C1[X(C15H28O6)]
method: RPBEPBE
basis: SDD
operation: Freq
keyword: #pfreq=noraman
keyword: PBEPBE/SDD
title: #p freq=noraman PBEPBE/SDD
converged: YES YES NO NO
title: Mulliken charges:
elementType: O O O O O O C C C C C C C C C C C C C C C H H H H H H H H H H H H H H H H H H H H H H H H H H H H
charge: -0.296461 -0.296448 -0.257292 -0.257346 -0.437648 -0.437646 0.032243 0.032225 -0.448785 -0.022908 -0.022896 -0.332045 -0.331989 -0.442225 -0.442232 -0.354678 -0.354693 -0.396771 -0.396755 -0.330358 -0.330360 0.219640 0.219658 0.238588 0.238598 0.213716 0.213706 0.221546 0.205924 0.221518 0.205943 0.200757 0.215222 0.200767 0.215227 0.225733 0.187336 0.225733 0.187321 0.189633 0.213411 0.189644 0.213402 0.185577 0.215545 0.185572 0.215549 0.329901 0.329900
chargesum: 0.00000
title: Mulliken charges with hydrogens summed into heavy atoms:
elementType: O O O O O O C C C C C C C C C C C C C C C
charge: -0.296461 -0.296448 -0.257292 -0.257346 -0.107747 -0.107746 0.251883 0.251883 0.028400 0.190808 0.190810 0.095425 0.095472 -0.026246 -0.026238 0.058391 0.058361 0.006273 0.006291 0.070765 0.070762
polarizability: 2.13409426e+02 -5.11701338e-03 1.62231346e+02 -3.13142969e+00 9.24936860e-03 1.68909590e+02
1716.lowfreq: -5.8375 -1.6086 0.0005 0.0007 0.0011 5.5752 6.8478 15.8584 19.1175
frequency: 6.8198 15.6501 18.9230 21.7191 46.1920 56.0297 63.3573 65.4758 78.8185 87.8644 98.6546 101.3169 125.8633 131.3071 139.5737 147.3914 150.6844 204.6013 209.9033 242.6593 254.4080 292.4103 295.4128 321.8717 323.7244 371.6886 386.9203 450.3457 453.5369 472.5760 477.9810 483.0036 531.2097 640.8543 653.3014 672.9817 673.7294 737.6228 739.6624 768.4247 781.0160 810.4639 826.5806 839.0180 860.1801 868.6549 901.8444 903.8142 931.1992 945.8300 949.6362 957.6349 964.7876 973.8933 992.0784 996.7831 997.5131 1033.7165 1035.5365 1051.0506 1063.6299 1063.9648 1076.0428 1076.9279 1082.2242 1083.8113 1103.0033 1103.1708 1122.2602 1137.7273 1145.2142 1156.0424 1186.1295 1187.7797 1217.0239 1231.2064 1232.2038 1248.8182 1249.4531 1260.0636 1266.3540 1278.1958 1287.3822 1287.4453 1287.9664 1294.1300 1298.2979 1298.8162 1310.8105 1312.9691 1321.5371 1322.5882 1338.0704 1343.1652 1355.5883 1360.0035 1367.5603 1368.6664 1383.0805 1383.4561 1390.5456 1400.3447 1437.1991 1448.8760 1448.9246 1465.7543 1465.7932 1474.5345 1474.6183 1483.2189 1483.4080 1487.7656 1487.8844 2947.9764 2948.0850 2948.1382 2950.0310 2953.9679 2954.5197 2957.6565 2957.7034 2969.5625 2969.6525 2976.4046 2976.5911 2995.6049 2996.1495 3015.6350 3015.6837 3030.1313 3030.1967 3040.1048 3052.9392 3053.0031 3064.4589 3064.5058 3072.5683 3072.6079 3110.8406 3558.7039 3558.7560
redmass: 5.6503 4.1681 6.1223 5.0165 3.2673 4.1117 1.8697 2.0334 3.8134 3.1478 3.6309 5.1028 3.0334 2.8207 3.0317 2.0238 2.3590 2.9369 3.2592 5.5789 4.7561 2.9869 5.4996 1.1417 1.1586 3.4530 3.2010 3.3160 2.8464 3.4206 2.9182 3.2174 2.4421 5.0991 4.9766 6.4265 5.4893 1.2197 1.1470 1.7331 1.5085 1.4454 1.8661 6.3903 3.2625 3.9419 1.3633 1.4361 5.9756 5.4384 4.7514 4.7035 2.7634 2.6478 2.7595 2.6834 4.0488 3.3626 3.7131 3.0433 2.7925 2.8168 1.8720 1.7995 2.0920 2.1884 1.6649 1.6874 2.4577 1.6227 1.3194 1.5712 1.4207 1.4989 1.3868 1.2756 1.2733 1.3034 1.3272 1.1569 1.1670 1.2342 1.1038 1.0635 1.1444 1.2589 1.2059 1.1939 1.1722 1.1878 1.2775 1.2914 1.2794 1.2977 1.3823 1.4139 1.6011 1.6613 1.2581 1.2635 1.5456 1.8504 1.0884 1.0828 1.0828 1.0715 1.0715 1.0859 1.0858 1.0890 1.0884 1.0955 1.0954 1.0841 1.0690 1.0690 1.0847 1.0840 1.0845 1.0635 1.0635 1.0610 1.0610 1.0622 1.0623 1.0596 1.0597 1.0936 1.0936 1.0979 1.0979 1.0597 1.1013 1.1013 1.1076 1.1076 1.0983 1.0983 1.1029 1.0661 1.0661
irintensity: 0.0257 5.6144 4.4711 0.0140 0.0030 1.1508 4.4143 2.1909 1.1463 1.2522 2.6102 1.9812 7.0522 9.7855 0.3761 0.3063 0.1750 2.0890 0.2155 0.3644 1.5026 26.7548 0.1521 36.5682 239.7195 1.3969 21.0307 10.7008 10.6464 24.8986 15.7445 0.7509 7.5636 1.3050 0.1743 1.7688 3.4421 2.2206 6.5473 28.2034 0.0674 6.3860 0.0811 40.9256 65.6359 54.8751 21.2446 0.7966 17.7825 89.6161 10.1299 91.4176 20.7112 180.0761 1.7243 9.5110 3.0526 120.1396 18.6444 121.0498 0.7749 16.7196 0.5290 19.6589 0.3939 9.2724 52.0542 9.5749 4.8852 22.2161 0.0604 24.6564 0.5630 0.1947 1.6169 41.1908 6.0110 3.8140 0.0237 1.0750 0.7646 2.1716 1.3076 0.6793 4.0564 18.4594 0.0425 1.0100 0.4064 6.6434 0.1316 0.6797 3.2491 5.5733 7.0749 23.6096 1.8055 16.0295 0.1267 38.1094 6.3244 65.9627 14.0105 5.3336 3.0408 0.7883 0.6376 1.5088 0.6015 3.9891 3.4434 16.0205 11.0253 53.6204 44.5855 78.2412 2.5478 53.2830 72.4293 6.9202 6.8588 14.6043 15.9585 74.5740 63.5977 150.1040 0.9990 8.5974 7.0405 6.1817 7.8727 5.7230 59.7759 39.9963 29.8933 49.1575 70.2207 73.0098 13.3996 7.9021 6.5345
temp: 298.150 k
press: 1.00000 atm
elementType: 8 8 8 8 8 8 6 6 6 6 6 6 6 6 6 6 6 6 6 6 6 1 1 1 1 1 1 1 1 1 1 1 1 1 1 1 1 1 1 1 1 1 1 1 1 1 1 1 1
symmnumber: 1
zpe: 1102475.6 jmol-1
zpe.correction: 0.419911 hartree
zpe.thermalcorrener: 0.444305 hartree
zpe.thermalcorrenthalpy: 0.445249 hartree
zpe.thermalcorrgfe: 0.359184 hartree
zpe.sumelectzpe: -1037.952067 hartree
zpe.sumelectthermal: -1037.927673 hartree
zpe.sumelectthermalent: -1037.926729 hartree
zpe.sumelectthermalfe: -1038.012794 hartree
dipole: 0.0008 -0.8589 0.0036
dipole: 0.8590
quadrupole: -146.5814 -151.9006 -119.3867
quadrupole: -0.0090 -11.1176 0.0353
quadrupole: -7.2919 -12.6110 19.9029 -0.0090 -11.1176 0.0353
hfenergy: -1038.3719779 hartree
pointgroup: C01 [X(C15H28O6)]
dipole: 0.0004294 -0.3379389 0.0005725 debye
polarizability: 213.5986507|0.0249934|162.2313546|-1.161484|-0.0082593|168.720357 unknown
InChI: InChI=1S/C15H28O6/c16-7-3-1-5-12-10-18-14(20-12)9-15-19-11-13(21-15)6-2-4-8-17/h12-17H,1-11H2
charge 0 multiplicity 1
49 atoms
O  -1.804597 -0.637319 0.457093
O  1.804929 -0.634774 -0.459478
O  -1.304557 -2.251895 2.069504
O  1.305951 -2.243986 -2.077635
O  -7.264456 2.479601 -1.910536
O  7.261478 2.481165 1.917988
C  -0.688784 -1.380366 1.051317
C  0.689623 -1.376313 -1.056443
C  0.00061 -2.232121 -0.004082
C  -2.689385 -0.306334 1.608111
C  2.689687 -0.29934 -1.609201
C  -2.471859 -1.500668 2.593326
C  2.473556 -1.490865 -2.598111
C  -4.122517 -0.148156 1.095038
C  4.122517 -0.141376 -1.095228
C  -4.282259 1.013459 0.090235
C  4.281065 1.01791 -0.087551
C  -5.730747 1.155928 -0.429243
C  5.729182 1.15989 0.433101
C  -5.879892 2.308594 -1.438696
C  5.877312 2.310736 1.44477
H  0.010946 -0.670309 1.545705
H  -0.010439 -0.664927 -1.548435
H  0.754538 -2.875387 0.480274
H  -0.752968 -2.874084 -0.490701
H  -2.331014 0.642082 2.063742
H  2.330513 0.650112 -2.062041
H  -3.327573 -2.19835 2.602264
H  -2.263559 -1.149167 3.621438
H  3.329563 -2.18818 -2.608177
H  2.266149 -1.136475 -3.625402
H  -4.791737 0.01698 1.964599
H  -4.428738 -1.103268 0.624399
H  4.791977 0.026327 -1.964111
H  4.429204 -1.097427 -0.626803
H  -3.587931 0.847844 -0.756088
H  -3.970124 1.963215 0.572919
H  3.586352 0.849945 0.757994
H  3.968715 1.96865 -0.568158
H  -6.043575 0.203594 -0.908949
H  -6.425919 1.332142 0.415214
H  6.042011 0.206767 0.911233
H  6.424827 1.337878 -0.410594
H  -5.186015 2.158094 -2.294807
H  -5.636214 3.274457 -0.963786
H  5.182803 2.158547 2.300071
H  5.633805 3.277414 0.97143
H  -7.554957 1.64181 -2.352424
H  7.5518 1.642647 2.358614
