program: Gaussian 09
title: 000110670
version: EM64L-G09RevD.01
frameworkgroup: C1[X(C8H16N2O2)]
method: RPBEPBE
basis: SDD
operation: Freq
keyword: #p
keyword: freq=noraman
keyword: PBEPBE/SDD
title: #p freq=noraman PBEPBE/SDD
converged: YES YES NO NO
title: Mulliken charges:
elementType: O O N N C C C C C C C C H H H H H H H H H H H H H H H H
charge: -0.204131 -0.273250 -0.066792 0.041450 -0.138414 -0.437743 0.224505 -0.689442 -0.487531 -0.338542 -0.671443 -0.655802 0.216673 0.282118 0.228485 0.251282 0.237075 0.204841 0.229813 0.233456 0.246618 0.217685 0.212442 0.238979 0.225987 0.214446 0.229503 0.227731
chargesum: 0.00000
title: Mulliken charges with hydrogens summed into heavy atoms:
elementType: O O N N C C C C C C C C
charge: -0.204131 -0.273250 -0.066792 0.041450 0.078259 0.072861 0.224505 0.003756 -0.024261 0.125761 0.005965 0.015878
polarizability: 1.22948174e+02 -3.46683026e+00 1.12506480e+02 2.47747951e+00 -8.20140196e-01 8.92571036e+01
1716.lowfreq: -13.1172 -3.8275 -0.0009 -0.0009 -0.0004 9.4536 23.2979 31.8826 48.1268
frequency: 22.7367 31.8595 47.9322 58.8301 90.5820 113.3333 155.6580 173.2666 202.3238 214.2799 229.0189 245.7854 264.1026 301.0338 346.9587 352.3446 370.1611 429.6432 505.5058 551.0148 612.8465 648.0727 763.2011 785.7960 792.3278 831.2620 841.1409 908.3254 961.6973 979.2592 992.7416 1021.8804 1029.4656 1059.5180 1075.6228 1092.4627 1109.6034 1128.1881 1188.2336 1217.5469 1236.6947 1274.2338 1288.0675 1299.8922 1326.1012 1331.4224 1343.9874 1355.5913 1370.9028 1389.8289 1391.7272 1396.2605 1431.1558 1433.5702 1464.3153 1468.5760 1469.2315 1471.4822 1476.0733 1480.0418 1483.4939 1624.9147 2957.7673 2978.6450 2987.6203 2991.1584 2994.1039 2998.0627 3003.7916 3015.0362 3062.8582 3072.3552 3086.3440 3087.3893 3093.5429 3097.4656 3102.9397 3108.4294
redmass: 2.9932 4.9688 2.0779 2.5865 3.1976 3.5916 2.1881 1.8159 1.5050 1.2335 1.7921 2.8161 2.4924 4.1477 4.9837 2.4934 3.4621 2.6919 3.6102 2.0842 3.8292 3.9709 3.0257 1.1714 1.4394 2.4933 2.8164 2.3448 1.9995 2.0787 1.9858 1.6041 1.7614 2.5146 2.2186 1.7901 2.4351 1.9425 2.1241 2.5641 1.2226 1.3835 1.6531 1.3180 2.5992 1.7194 1.2855 1.5243 1.7553 1.2213 1.1892 1.2041 1.0895 1.0962 1.0724 1.0403 1.0489 1.0583 1.0451 1.0499 1.0566 8.1500 1.0645 1.0654 1.0425 1.0620 1.0477 1.0365 1.0587 1.0927 1.0964 1.1030 1.0982 1.0995 1.1005 1.1017 1.0998 1.1008
irintensity: 1.9020 1.0878 0.3351 1.7956 1.5314 3.8932 0.0161 0.9372 0.3680 0.4082 1.3908 1.8941 2.2449 9.6144 5.3090 1.8697 3.2391 4.6411 3.2900 0.4503 0.5727 2.8264 1.3029 9.3131 12.9759 6.4976 25.6525 49.4431 15.9029 89.3114 63.6910 4.6260 15.8336 5.4376 3.1134 12.7831 27.5518 5.5259 27.1753 13.8891 1.4310 7.4835 29.7278 16.2820 93.2680 43.4040 5.7609 5.0720 23.0126 12.0645 16.4992 21.9227 25.2068 6.3072 12.0689 13.6115 6.0023 24.7086 18.9691 17.2879 13.1698 90.8645 19.5970 39.5403 5.8979 33.9061 23.5770 28.4685 16.2229 13.6094 0.0953 6.7063 47.6672 29.3348 28.7195 33.4581 25.9601 14.1020
temp: 298.150 k
press: 1.00000 atm
elementType: 8 8 7 7 6 6 6 6 6 6 6 6 1 1 1 1 1 1 1 1 1 1 1 1 1 1 1 1
symmnumber: 1
zpe: 617217.1 jmol-1
zpe.correction: 0.235086 hartree
zpe.thermalcorrener: 0.250038 hartree
zpe.thermalcorrenthalpy: 0.250982 hartree
zpe.thermalcorrgfe: 0.191288 hartree
zpe.sumelectzpe: -573.358999 hartree
zpe.sumelectthermal: -573.344046 hartree
zpe.sumelectthermalent: -573.343102 hartree
zpe.sumelectthermalfe: -573.402797 hartree
dipole: -1.0948 5.7367 1.2702
dipole: 5.9767
quadrupole: -77.0880 -78.5165 -74.2219
quadrupole: 7.5083 -7.5352 -2.1754
quadrupole: -0.4792 -1.9076 2.3869 7.5083 -7.5352 -2.1754
hfenergy: -573.5940844 hartree
pointgroup: C01 [X(C8H16N2O2)]
dipole: -0.2943538 -2.185881 -0.8151831 debye
polarizability: 122.3335311|4.4994339|112.8170171|-2.5258308|2.3258399|89.5612086 unknown
InChI: InChI=1S/C8H16N2O2/c1-4-8(11)7(3)6-10(5-2)9-12/h7H,4-6H2,1-3H3
charge 0 multiplicity 1
28 atoms
O  -2.085495 0.396238 1.471962
O  2.082254 2.3132 0.222482
N  2.023281 0.05567 0.349551
N  2.750268 1.219533 0.10559
C  -0.44406 -0.105315 -0.272965
C  0.627619 0.077855 0.837205
C  -1.845234 -0.158577 0.36611
C  -0.402246 1.042437 -1.323622
C  -2.921569 -0.922173 -0.409854
C  2.837959 -1.177168 0.333283
C  -4.353578 -0.663258 0.088867
C  2.37417 -2.229464 -0.693924
H  -0.277837 -1.061785 -0.808589
H  0.463667 1.054587 1.327895
H  0.520773 -0.715098 1.600324
H  -0.554508 2.020172 -0.83728
H  0.582235 1.064415 -1.8213
H  -1.175153 0.903123 -2.100927
H  -2.670823 -2.002071 -0.320987
H  -2.820126 -0.690424 -1.488905
H  3.86679 -0.846068 0.108623
H  2.837742 -1.619565 1.350024
H  -5.079042 -1.28781 -0.46169
H  -4.438009 -0.887036 1.165567
H  -4.632477 0.396312 -0.045932
H  1.372942 -2.628585 -0.452816
H  2.349166 -1.803869 -1.712316
H  3.080291 -3.079477 -0.692477
