program: Gaussian 09
title: 000110665
version: EM64L-G09RevD.01
frameworkgroup: C1[X(C11H17NO)]
method: RPBEPBE
basis: SDD
operation: Freq
keyword: #p
keyword: freq=noraman
keyword: PBEPBE/SDD
title: #p freq=noraman PBEPBE/SDD
converged: YES YES NO NO
title: Mulliken charges:
elementType: O N C C C C C C C C C C C H H H H H H H H H H H H H H H H H
charge: -0.469251 -0.101227 -0.492746 -0.177437 -0.357672 0.451686 -0.428795 -0.388860 -0.611427 -0.619753 -0.234286 -0.225057 -0.244009 0.236536 0.195676 0.225939 0.238294 0.191164 0.260344 0.267420 0.230982 0.191427 0.220099 0.223827 0.190422 0.225672 0.332219 0.223076 0.221376 0.224362
chargesum: 0.00000
title: Mulliken charges with hydrogens summed into heavy atoms:
elementType: O N C C C C C C C C C C C
charge: -0.137032 -0.101227 -0.060535 0.048502 0.071786 0.451686 -0.168451 -0.121440 0.031081 0.020169 -0.011210 -0.003681 -0.019647
polarizability: 1.50889523e+02 8.68614047e+00 1.34270242e+02 -1.33367238e+01 8.52031718e+00 8.86129243e+01
1716.lowfreq: -15.1995 -7.9361 -3.0638 -0.0005 -0.0005 0.0003 29.8166 37.9723 52.0070
frequency: 29.6682 37.8464 51.9464 98.5199 101.4374 203.3426 212.9645 234.8599 243.3650 278.8683 300.2553 304.6527 349.1835 371.2247 404.6842 407.2345 438.4656 525.7774 574.4197 585.5617 616.4447 707.8025 731.2005 759.1186 776.4120 856.8398 862.6887 924.6561 950.4654 977.0955 983.9101 990.4399 995.7180 1022.6486 1032.5557 1033.1907 1047.1695 1080.8504 1082.8675 1095.8039 1133.6881 1142.9813 1158.3072 1170.5315 1184.5743 1218.4351 1230.0993 1262.1611 1265.1684 1289.6077 1321.1480 1339.2462 1367.9089 1381.0655 1398.9819 1416.9390 1438.1009 1441.7614 1451.9783 1462.0402 1465.8069 1474.8112 1476.8465 1485.3067 1487.4278 1593.7008 1615.3667 2836.4304 2848.3162 2864.9648 2964.6139 2984.2261 3016.6528 3024.3293 3027.3871 3043.0199 3075.3148 3081.6712 3116.1661 3124.6585 3137.3942 3153.5018 3166.7322 3559.4594
redmass: 3.2202 3.7431 3.1160 3.8007 3.4453 1.7693 3.9621 1.3508 1.3027 1.1865 2.2290 3.1170 2.7859 1.9827 2.8624 2.6713 3.1979 3.0962 3.3330 3.5043 6.4095 1.8295 2.6745 2.4344 2.4098 2.0763 1.2456 1.4845 2.1854 5.5618 1.5297 4.1314 1.3223 2.2218 1.5337 1.8471 2.1568 1.6178 1.4787 1.9638 1.4052 1.5219 1.4691 1.0563 1.1302 1.5813 1.5617 2.0964 1.7168 1.1861 1.3328 1.3970 1.3899 4.4285 1.7747 1.1549 1.3368 1.6683 1.0984 1.0601 1.1006 1.0663 1.0569 2.1201 1.0954 6.1807 6.0616 1.0704 1.0569 1.0575 1.0650 1.0846 1.0728 1.0824 1.0770 1.0962 1.1013 1.1005 1.0850 1.0882 1.0935 1.0972 1.0979 1.0659
irintensity: 0.6277 0.3439 0.0677 0.6087 1.2625 2.4797 3.0073 3.7239 7.3795 115.0980 15.1419 4.3301 12.3378 4.8717 0.4606 1.1213 1.5993 15.0286 5.0859 16.9886 0.2530 59.6051 8.1860 18.1734 48.8044 18.2284 0.5722 17.8711 7.3119 69.1865 0.5709 0.0416 1.1318 12.5205 17.1881 1.2811 26.6608 0.7802 5.3717 6.1997 12.1474 2.8212 78.3911 1.1036 4.5290 13.3767 0.3412 15.1242 2.3649 1.6893 4.5992 4.2451 7.1389 3.4872 11.3015 5.3306 14.4619 2.9320 8.4169 12.2480 10.6435 13.5817 15.8075 17.5337 11.1974 0.4239 4.4723 59.9226 72.0370 263.1327 51.4134 20.3933 34.9091 19.5648 34.0281 51.0691 30.9653 47.2497 1.0441 3.4910 30.6068 31.2773 12.3061 5.6920
temp: 298.150 k
press: 1.00000 atm
elementType: 8 7 6 6 6 6 6 6 6 6 6 6 6 1 1 1 1 1 1 1 1 1 1 1 1 1 1 1 1 1
symmnumber: 1
zpe: 675776.4 jmol-1
zpe.correction: 0.257390 hartree
zpe.thermalcorrener: 0.271169 hartree
zpe.thermalcorrenthalpy: 0.272113 hartree
zpe.thermalcorrgfe: 0.215983 hartree
zpe.sumelectzpe: -558.305535 hartree
zpe.sumelectthermal: -558.291755 hartree
zpe.sumelectthermalent: -558.290811 hartree
zpe.sumelectthermalfe: -558.346941 hartree
dipole: 2.9327 -0.4738 1.0096
dipole: 3.1375
quadrupole: -73.4919 -73.9568 -81.9994
quadrupole: 5.3108 -4.0422 2.2382
quadrupole: 2.9908 2.5259 -5.5167 5.3108 -4.0422 2.2382
hfenergy: -558.5629247 hartree
pointgroup: C01 [X(C11H17N1O1)]
dipole: 1.1556948 0.1999264 -0.3849114 debye
polarizability: 150.8036343|-8.5484008|134.0893349|13.9275655|8.509628|88.8797204 unknown
InChI: InChI=1S/C11H17NO/c1-12(2)9-8-11(13)10-6-4-3-5-7-10/h3-7,11,13H,8-9H2,1-2H3
charge 0 multiplicity 1
30 atoms
O  -0.284862 -2.712844 0.631455
N  2.594601 0.61369 0.109174
C  1.213733 -1.325361 -0.769361
C  0.24703 -1.342333 0.447071
C  1.859026 0.046694 -1.051088
C  -0.950733 -0.422623 0.260915
C  -0.887812 0.921613 0.705432
C  -2.123293 -0.88298 -0.387814
C  2.919303 2.040275 -0.102598
C  3.793023 -0.166282 0.47744
C  -1.976991 1.797734 0.495078
C  -3.213758 -0.008345 -0.594089
C  -3.143747 1.335728 -0.157609
H  0.650091 -1.639954 -1.669042
H  2.00223 -2.089711 -0.603709
H  0.812561 -1.028222 1.347654
H  1.061396 0.76423 -1.318754
H  2.525791 -0.049425 -1.948307
H  0.01821 1.27168 1.215537
H  -2.177542 -1.931416 -0.696783
H  1.99032 2.609604 -0.285637
H  3.606789 2.214276 -0.969514
H  3.4030 2.45133 0.801848
H  4.27365 0.291928 1.360236
H  4.552463 -0.216393 -0.344727
H  3.515571 -1.199832 0.747296
H  0.479156 -3.340927 0.689335
H  -1.919357 2.834453 0.846683
H  -4.120547 -0.375565 -1.088811
H  -3.991502 2.012182 -0.316412
