program: Gaussian 09
title: 000110663
version: EM64L-G09RevD.01
frameworkgroup: C1[X(C9H18NO2PS3)]
method: RPBEPBE
basis: SDD
operation: Freq
keyword: #p
keyword: freq=noraman
keyword: PBEPBE/SDD
title: #p freq=noraman PBEPBE/SDD
converged: YES YES NO NO
title: Mulliken charges:
elementType: S S S P O O N C C C C C C C C C H H H H H H H H H H H H H H H H H H
charge: 0.310127 0.311368 -0.255157 0.799624 -0.468270 -0.468199 -0.257452 -0.376026 -0.376986 -0.669861 -0.670666 -0.402122 -0.203742 -0.212663 -0.656178 -0.657411 0.301461 0.300197 0.240558 0.228131 0.233865 0.234466 0.242588 0.226489 0.225733 0.227474 0.226074 0.223426 0.206775 0.234001 0.231233 0.207222 0.234645 0.229276
chargesum: 0.00000
title: Mulliken charges with hydrogens summed into heavy atoms:
elementType: S S S P O O N C C C C C C C C C
charge: 0.310127 0.311368 -0.255157 0.799624 -0.468270 -0.468199 -0.257452 -0.074565 -0.076789 0.032693 0.032877 -0.402122 0.249465 0.236837 0.015831 0.013732
polarizability: 2.69839815e+02 -1.93989146e+00 1.74879262e+02 5.02138600e+00 1.62009851e+01 1.62504911e+02
1716.lowfreq: -9.2666 -4.0250 -0.0028 0.0009 0.0010 6.5788 11.4289 20.9884 26.7250
frequency: 6.0624 20.6857 26.6474 37.1943 40.6592 52.3950 70.0522 77.6691 97.0366 107.7569 129.0618 186.1980 191.6653 205.9759 212.9095 223.0506 239.7176 256.5375 264.5433 266.9766 280.6249 305.6959 316.0962 331.0777 386.5410 392.9167 417.7777 429.3701 436.7990 480.3054 526.9281 534.9959 636.3697 651.2571 686.1664 699.7966 736.3745 809.1708 810.1976 811.4928 849.1450 873.6948 883.2204 958.3213 1014.6641 1018.9704 1026.8862 1055.4863 1076.5784 1077.5578 1105.0408 1106.6670 1135.2231 1135.4209 1152.1593 1200.3277 1246.6411 1254.1599 1255.0102 1282.4880 1338.5476 1355.5419 1356.1671 1391.3285 1393.5155 1394.9536 1397.3233 1457.0650 1457.9712 1466.5879 1469.6264 1472.6373 1477.8985 1478.8830 1482.6198 1488.0278 1488.7248 1566.7315 2980.0878 2986.3351 2989.2394 2991.3912 2994.6270 2994.8457 3027.0791 3042.9462 3043.2252 3053.1096 3083.7914 3088.1832 3091.2161 3091.4326 3094.4763 3096.4878 3107.8699 3109.0644
redmass: 4.9179 3.6350 3.1624 2.6435 2.0429 2.8847 7.5243 4.8982 3.9057 5.5911 7.1780 5.0035 1.1225 2.6851 1.2339 1.8791 1.5708 2.1022 2.0032 3.6360 3.5621 4.9556 2.7620 5.9041 5.9596 5.4314 6.0960 13.1734 7.1636 10.8566 12.3644 10.9914 3.7891 3.1270 6.6051 7.0993 13.0922 1.2251 1.1357 4.2486 2.1550 4.2902 3.7321 1.2794 1.5400 2.5427 2.7789 1.3805 2.4736 2.7758 2.2037 2.1778 1.4350 1.4327 2.0773 1.2575 1.2403 1.1391 1.1404 1.3079 1.4227 1.2540 1.2568 1.2049 1.2470 1.2490 1.1892 1.0404 1.0404 1.0549 1.0416 1.0451 1.0540 1.0520 1.0429 1.0770 1.0798 12.5744 1.0552 1.0553 1.0357 1.0356 1.0371 1.0374 1.0848 1.0880 1.1082 1.1071 1.0994 1.0989 1.0981 1.0983 1.1007 1.0998 1.1019 1.1022
irintensity: 1.5545 1.2319 1.0840 1.0574 0.8954 4.1451 1.2680 2.7737 0.2709 2.7325 3.7909 1.4536 0.0363 1.2734 0.1780 6.0854 0.9844 9.7441 1.2248 8.9263 4.4742 2.6994 0.1933 6.0666 3.0009 1.7550 60.2426 35.1005 7.7977 13.2837 9.6414 54.9485 7.6564 8.0925 95.5560 119.8463 114.1585 7.3945 10.5255 64.9616 1.6410 226.4778 148.8483 9.0258 24.6708 156.9022 107.7561 12.7859 0.4241 1.3877 17.2226 9.7339 1.7312 6.5389 0.8813 3.4571 49.7780 0.2724 1.6622 0.0791 0.7950 8.8466 7.7733 22.2301 24.7594 28.0958 20.9212 12.4456 11.9257 2.8403 25.9213 13.8151 5.2650 7.6561 9.6047 8.7975 9.7592 1019.3674 28.2809 28.9354 9.7917 41.9890 36.4548 20.8382 2.9912 8.4527 14.9823 13.1849 18.5517 18.4171 28.7338 29.8997 0.5617 41.8056 32.8787 32.8083
temp: 298.150 k
press: 1.00000 atm
elementType: 16 16 16 15 8 8 7 6 6 6 6 6 6 6 6 6 1 1 1 1 1 1 1 1 1 1 1 1 1 1 1 1 1 1
symmnumber: 1
zpe: 693235.8 jmol-1
zpe.correction: 0.264040 hartree
zpe.thermalcorrener: 0.285841 hartree
zpe.thermalcorrenthalpy: 0.286786 hartree
zpe.thermalcorrgfe: 0.208187 hartree
zpe.sumelectzpe: -2093.071528 hartree
zpe.sumelectthermal: -2093.049726 hartree
zpe.sumelectthermalent: -2093.048782 hartree
zpe.sumelectthermalfe: -2093.127380 hartree
dipole: -4.1492 0.2666 -0.5406
dipole: 4.1928
quadrupole: -94.8001 -118.3264 -136.2279
quadrupole: -1.6110 -2.5529 -5.4354
quadrupole: 21.6513 -1.8749 -19.7764 -1.6110 -2.5529 -5.4354
hfenergy: -2093.3355673 hartree
pointgroup: C01 [X(C9H18N1O2P1S3)]
dipole: -1.6242714 0.25861 -0.1261455 debye
polarizability: 268.242563|-12.2074023|186.8365965|-1.6950746|6.0499525|152.1448285 unknown
InChI: InChI=1S/C9H18NO2PS3/c1-5-11-13(14,12-6-2)10-9-15-7(3)8(4)16-9/h7-8H,5-6H2,1-4H3
charge 0 multiplicity 1
34 atoms
S  -2.855667 -1.432502 -0.337818
S  -1.76652 1.370203 0.338236
S  1.704046 1.127586 1.476526
P  1.358288 -0.161526 -0.117036
O  1.541891 0.467065 -1.716341
O  2.436919 -1.510441 -0.217243
N  -0.212141 -0.936675 -0.246812
C  -4.104494 -0.157974 0.349494
C  -3.628449 1.232273 -0.108447
C  -5.510708 -0.530462 -0.149754
C  -4.37551 2.396374 0.561315
C  -1.37396 -0.384056 -0.099453
C  2.769251 1.266273 -2.01098
C  2.636535 -2.336646 1.006946
C  2.516527 1.954132 -3.349313
C  3.723888 -3.35068 0.663765
H  -4.040581 -0.230501 1.450132
H  -3.682564 1.303499 -1.20983
H  -5.779422 -1.558054 0.150869
H  -6.263225 0.14969 0.287881
H  -5.574339 -0.464418 -1.250415
H  -4.310319 2.332029 1.661991
H  -3.955928 3.367982 0.247822
H  -5.441172 2.38547 0.269834
H  2.929262 1.995862 -1.192967
H  3.630193 0.574046 -2.056626
H  2.933955 -1.674649 1.843595
H  1.678813 -2.832423 1.257642
H  3.403294 2.549062 -3.637124
H  2.323057 1.209301 -4.139749
H  1.646234 2.628564 -3.281815
H  3.914029 -4.005742 1.534175
H  3.414001 -3.979647 -0.187848
H  4.664216 -2.838613 0.397549
