program: Gaussian 09
title: 000110648
version: EM64L-G09RevD.01
frameworkgroup: C1[X(C16H22N2O)]
method: RPBEPBE
basis: SDD
operation: Freq
keyword: #p
keyword: freq=noraman
keyword: PBEPBE/SDD
title: #p freq=noraman PBEPBE/SDD
converged: YES YES NO NO
title: Mulliken charges:
elementType: O N N C C C C C C C C C C C C C C C C H H H H H H H H H H H H H H H H H H H H H H
charge: -0.247396 -0.106427 -0.212718 -0.158452 -0.495731 -0.365663 -0.355030 -0.398372 -0.397125 -0.392923 -0.401058 0.101713 0.429496 -0.344799 -0.366364 -0.392190 -0.410039 0.454134 -0.810452 0.241635 0.228950 0.229394 0.244380 0.181500 0.175236 0.201592 0.202248 0.195518 0.192554 0.202763 0.236432 0.248186 0.191362 0.213826 0.303765 0.241003 0.229301 0.227759 0.225057 0.222095 0.234839
chargesum: 0.00000
title: Mulliken charges with hydrogens summed into heavy atoms:
elementType: O N N C C C C C C C C C C C C C C C C
charge: -0.247396 -0.106427 -0.212718 0.083183 -0.037387 0.060216 0.021798 -0.000607 -0.001808 0.091695 0.004131 0.101713 0.429496 -0.041034 -0.125361 -0.162889 -0.182280 0.454134 -0.128460
polarizability: 2.61896009e+02 1.70282527e+01 1.57341045e+02 1.67599524e+01 -1.66814627e+01 1.54583575e+02
1716.lowfreq: -7.0207 -0.0007 -0.0007 -0.0005 4.9871 9.3397 12.8373 26.4378 46.2377
frequency: 10.9090 26.3067 46.0991 53.6785 78.2256 112.8276 132.9559 162.1969 182.3715 213.7489 239.9986 261.4683 282.7382 299.1772 330.1637 352.8012 357.1991 397.1267 403.9667 411.0348 427.4460 444.4990 502.5351 528.8686 545.8880 611.4896 637.7705 660.5235 682.8890 706.2078 717.7388 774.4017 799.8325 808.7503 816.8326 844.0377 852.0009 854.7157 879.4186 905.6052 923.6975 942.4936 949.1511 961.1294 984.5578 985.5196 989.4222 1009.3161 1030.7765 1037.2792 1046.7567 1061.6376 1077.9564 1098.4906 1104.4157 1121.2651 1135.4085 1145.6556 1154.7466 1192.6635 1199.4129 1202.6098 1208.5066 1224.9856 1228.3567 1258.2944 1267.6996 1272.6663 1288.1024 1302.1364 1313.2354 1322.2354 1323.8138 1334.5110 1344.1503 1351.8874 1358.6985 1361.3724 1380.7068 1388.1498 1397.1122 1420.3488 1454.9625 1459.4144 1463.8668 1468.2028 1471.4866 1472.5718 1473.7205 1482.2699 1484.4348 1512.4585 1576.8657 1616.4718 1628.7339 2834.5655 2865.0357 2909.6542 2969.5601 2972.5327 2984.2815 2986.1332 2995.1807 3019.2085 3031.6973 3035.9730 3044.7112 3053.1159 3053.9135 3061.8298 3076.9993 3082.2810 3099.6448 3121.1480 3125.0861 3161.5251 3190.5289
redmass: 1.0384 4.2782 3.5544 2.9679 4.1992 3.2074 5.0316 3.0579 4.0528 2.8718 2.7647 2.5522 2.1679 4.4331 4.2321 2.8108 4.1546 2.1224 3.0070 2.9939 3.6676 2.9420 2.3637 2.6493 2.7014 3.7931 6.5820 5.5517 3.9960 3.1104 3.0761 4.1120 3.2519 1.7213 1.4968 2.8311 1.2962 1.4178 1.9679 2.8972 2.8889 1.3472 1.9542 1.4878 2.3578 1.4380 1.3691 2.9456 2.0766 2.0454 1.5475 1.8822 1.6626 2.8172 2.5241 2.9698 1.3854 2.1778 1.2680 1.2870 1.2553 1.4009 2.2181 2.2764 2.6332 1.2514 1.4876 1.1661 1.2072 1.7989 1.4853 1.4284 1.3942 1.3034 1.4201 1.5241 1.4269 3.3463 2.7611 1.4819 1.2289 3.1410 1.0890 1.0955 1.0879 1.0959 1.0826 1.0754 1.0814 1.1134 1.0966 2.6218 6.0915 9.5709 6.4814 1.0711 1.0713 1.0829 1.0622 1.0387 1.0613 1.0614 1.0596 1.0666 1.0906 1.0927 1.1027 1.0948 1.1032 1.1028 1.0891 1.0997 1.1007 1.0894 1.0905 1.0937 1.0942
irintensity: 0.6502 0.6466 0.0339 0.5440 0.4402 0.3806 5.7356 5.4155 1.2298 0.0509 0.9083 0.9373 1.5654 3.4328 0.3121 2.2100 7.4553 2.1034 0.4423 0.0695 3.1701 0.0503 9.6536 12.9993 2.3680 0.2419 0.4659 7.8041 4.3192 3.2023 0.9133 15.5300 5.8135 1.5608 51.0592 8.2971 22.5936 5.6030 1.3114 5.3079 9.6689 1.9542 10.5124 4.3198 15.8257 4.2475 6.2239 0.9368 3.2918 14.6819 18.5621 6.8318 22.2654 2.2099 27.8335 6.9426 17.5546 15.8202 4.2147 6.9558 3.2901 8.4798 29.6159 36.4099 1.5197 4.7095 1.1814 11.3037 7.4773 42.0617 63.5917 26.3935 33.9395 2.0981 0.5143 15.8330 1.0303 71.8343 50.7459 2.7509 12.5072 3.3816 7.6280 5.7564 12.1824 18.3387 8.6761 11.7947 15.6225 33.0126 5.8808 175.3604 0.3003 266.6914 13.8382 88.1078 74.2531 77.4037 40.1357 47.6448 36.7768 32.6189 29.7168 24.5822 78.5691 49.1168 18.9876 24.5676 87.7078 28.4803 22.9591 18.4707 36.5851 21.4105 23.4228 13.5192 5.9883
temp: 298.150 k
press: 1.00000 atm
elementType: 8 7 7 6 6 6 6 6 6 6 6 6 6 6 6 6 6 6 6 1 1 1 1 1 1 1 1 1 1 1 1 1 1 1 1 1 1 1 1 1 1
symmnumber: 1
zpe: 922906.0 jmol-1
zpe.correction: 0.351516 hartree
zpe.thermalcorrener: 0.369084 hartree
zpe.thermalcorrenthalpy: 0.370028 hartree
zpe.thermalcorrgfe: 0.303872 hartree
zpe.sumelectzpe: -806.205073 hartree
zpe.sumelectthermal: -806.187506 hartree
zpe.sumelectthermalent: -806.186562 hartree
zpe.sumelectthermalfe: -806.252718 hartree
dipole: 0.6985 2.2441 -2.3218
dipole: 3.3038
quadrupole: -100.3324 -108.9671 -118.3301
quadrupole: 3.5867 3.2209 -0.3803
quadrupole: 8.8775 0.2427 -9.1202 3.5867 3.2209 -0.3803
hfenergy: -806.5565898 hartree
pointgroup: C01 [X(C16H22N2O1)]
dipole: -0.2420006 -0.9937219 -0.8021382 debye
polarizability: 261.460101|17.2141636|162.1234369|-17.9813249|15.5591645|150.2370919 unknown
InChI: InChI=1S/C16H22N2O/c1-13-5-7-14(8-6-13)18-12-9-15(16(18)19)17-10-3-2-4-11-17/h5-8,15H,2-4,9-12H2,1H3
charge 0 multiplicity 1
41 atoms
O  -0.19352 0.855808 2.005219
N  -2.593091 -0.231864 0.035647
N  0.574607 -0.748473 0.418947
C  -1.721287 -0.890842 1.061768
C  -1.24382 -2.276003 0.563679
C  -2.682492 1.254021 0.159867
C  -3.960109 -0.827771 0.054352
C  -3.493448 1.845226 -1.011124
C  -4.814138 -0.305821 -1.118434
C  0.018507 -1.946718 -0.264922
C  -4.910795 1.235434 -1.077465
C  -0.380733 -0.136387 1.243802
C  1.901778 -0.2911 0.158253
C  2.501576 0.751614 0.919461
C  2.655129 -0.889926 -0.888667
C  3.815663 1.166827 0.626939
C  3.96929 -0.459139 -1.161654
C  4.578664 0.5789 -0.414571
C  5.982734 1.061915 -0.733563
H  -2.225332 -0.938304 2.055309
H  -1.997691 -2.802586 -0.041595
H  -0.975556 -2.914098 1.425595
H  -1.666491 1.67881 0.161354
H  -3.158043 1.546454 1.130721
H  -4.478868 -0.589413 1.021147
H  -3.87758 -1.927896 -0.006122
H  -2.955269 1.636155 -1.956255
H  -3.54584 2.944646 -0.892934
H  -5.820401 -0.765464 -1.069964
H  -4.344662 -0.622996 -2.069875
H  0.753862 -2.769661 -0.251176
H  -0.23703 -1.705909 -1.313975
H  -5.486759 1.543679 -0.180249
H  -5.459172 1.615214 -1.960178
H  1.932754 1.220324 1.724276
H  2.220842 -1.684485 -1.502437
H  4.259117 1.969524 1.229155
H  4.528578 -0.938849 -1.97431
H  6.503318 1.418744 0.172816
H  6.594565 0.26106 -1.185376
H  5.962242 1.904746 -1.452163
