program: Gaussian 09
title: 000110642
version: EM64L-G09RevD.01
frameworkgroup: C1[X(C14H18N2O)]
method: RPBEPBE
basis: SDD
operation: Freq
keyword: #p
keyword: freq=noraman
keyword: PBEPBE/SDD
title: #p freq=noraman PBEPBE/SDD
converged: YES YES NO NO
title: Mulliken charges:
elementType: O N N C C C C C C C C C C C C C C H H H H H H H H H H H H H H H H H H
charge: -0.248896 -0.121588 -0.219380 -0.193235 -0.499479 -0.366039 -0.343130 -0.441939 -0.450639 -0.389258 0.140988 0.438517 -0.349068 -0.368329 -0.226446 -0.235659 -0.250369 0.241901 0.234531 0.232013 0.210840 0.184421 0.189529 0.249773 0.223244 0.214084 0.206562 0.226894 0.248473 0.237034 0.304738 0.242504 0.225976 0.223518 0.227912
chargesum: 0.00000
title: Mulliken charges with hydrogens summed into heavy atoms:
elementType: O N N C C C C C C C C C C C C C C
charge: -0.248896 -0.121588 -0.219380 0.048666 -0.032935 0.029222 0.096172 -0.004611 -0.017183 0.096249 0.140988 0.438517 -0.044330 -0.125825 -0.000470 -0.012141 -0.022456
polarizability: 2.22381916e+02 8.17824976e+00 1.50481607e+02 -1.86577405e+01 1.46296143e+01 1.21170571e+02
1716.lowfreq: -5.1846 -2.7202 0.0006 0.0009 0.0010 12.8773 32.1851 41.0502 45.2000
frequency: 32.0145 40.7640 45.0933 61.7372 95.9342 137.8405 152.4000 182.3205 206.6222 251.4881 306.0145 315.7904 326.7588 372.2873 385.0330 408.5664 485.9167 531.8896 574.5706 614.4065 624.5976 657.4674 664.4262 693.9917 695.9698 734.4597 766.3003 786.2183 828.5656 839.1983 856.7159 885.5374 905.4751 914.5155 922.0596 946.5778 964.7171 972.7732 977.1989 984.3929 998.2656 1021.9336 1035.5347 1047.8205 1073.2786 1080.1691 1095.6161 1108.0101 1125.9372 1133.0475 1173.5664 1185.3053 1188.4587 1197.2982 1198.6761 1206.7246 1213.9197 1222.3653 1241.3867 1266.6407 1284.0819 1295.0978 1302.4162 1314.2830 1325.2522 1328.2863 1333.4438 1359.6359 1370.0168 1385.9957 1446.7433 1465.8083 1467.4047 1477.6183 1479.4320 1483.5143 1490.9818 1494.5933 1585.2151 1612.0153 1623.4734 2848.3300 2876.9754 2887.1497 2994.4671 3011.4213 3022.6466 3024.4775 3038.6677 3061.5139 3066.8502 3081.4941 3093.6088 3101.7595 3126.9690 3137.2618 3155.4155 3167.6173 3193.3370
redmass: 4.7710 2.9413 3.0736 1.7805 4.3430 4.1183 3.1146 3.4262 3.3495 3.3828 3.5845 2.5625 7.6456 3.0208 5.0436 2.9400 3.9666 3.2741 3.4505 6.3902 2.8425 6.2464 4.0761 3.6974 1.9833 2.0498 1.7320 2.4260 1.8980 1.2718 1.8632 1.9341 2.6955 1.4370 4.7047 2.3063 1.5551 1.3525 2.0227 5.8269 1.3103 2.2792 2.1093 1.9618 2.3092 2.0037 1.6278 2.7015 3.4983 2.4818 1.0541 1.3594 1.3307 1.2090 1.1875 1.4795 2.6168 1.5667 1.2167 1.4258 1.2085 1.3242 1.7367 1.5982 1.4524 1.3793 1.3686 1.5109 2.4384 4.6963 2.4151 1.0849 1.0980 1.0864 1.0860 1.2468 1.8475 1.1163 6.2185 6.2613 9.5342 1.0719 1.0759 1.0780 1.0597 1.0591 1.0669 1.0641 1.0871 1.1025 1.1035 1.0929 1.1035 1.1008 1.0849 1.0899 1.0938 1.0990 1.0949
irintensity: 0.7961 0.1834 0.6759 0.6527 1.8688 3.9705 0.8178 6.0226 0.8913 0.5202 2.3070 2.4635 4.8543 1.4277 0.8048 0.0963 11.1813 7.8861 2.3335 0.7631 0.7275 6.0551 5.9208 11.1150 36.2169 0.8755 70.9828 15.0702 24.3494 0.3012 15.1581 3.3515 6.7485 8.1449 0.0583 10.7209 1.5346 0.4261 5.8303 0.6748 2.3724 7.4295 20.6325 6.4407 1.4019 3.1759 1.4408 32.1635 15.8345 36.6564 0.6377 11.9523 0.2363 1.3647 7.5097 14.7507 52.1702 5.3080 8.1128 1.9554 7.9612 2.0350 56.8254 101.2366 12.4699 5.2905 1.3122 54.6225 80.7673 10.6105 6.4876 10.4742 8.0298 13.3086 10.7573 78.9416 78.9179 4.4247 1.3163 144.8766 174.2138 84.9660 25.0818 143.7901 29.4469 28.6946 19.7297 74.4320 39.6314 30.4469 3.5122 14.4551 71.0678 34.1898 1.3873 17.1948 37.8749 13.8625 9.0269
temp: 298.150 k
press: 1.00000 atm
elementType: 8 7 7 6 6 6 6 6 6 6 6 6 6 6 6 6 6 1 1 1 1 1 1 1 1 1 1 1 1 1 1 1 1 1 1
symmnumber: 1
zpe: 776243.8 jmol-1
zpe.correction: 0.295656 hartree
zpe.thermalcorrener: 0.310592 hartree
zpe.thermalcorrenthalpy: 0.311536 hartree
zpe.thermalcorrgfe: 0.251957 hartree
zpe.sumelectzpe: -727.749665 hartree
zpe.sumelectthermal: -727.734729 hartree
zpe.sumelectthermalent: -727.733784 hartree
zpe.sumelectthermalfe: -727.793364 hartree
dipole: 1.3755 3.2162 1.0044
dipole: 3.6393
quadrupole: -89.9864 -97.3190 -103.9538
quadrupole: 0.9167 -3.2693 -1.5005
quadrupole: 7.1000 -0.2326 -6.8674 0.9167 -3.2693 -1.5005
hfenergy: -728.0453205 hartree
pointgroup: C01 [X(C14H18N2O1)]
dipole: -0.5183482 -1.2583873 0.4448599 debye
polarizability: 222.5462868|9.6544774|149.6963708|17.3933201|-15.4644596|121.7914364 unknown
InChI: InChI=1S/C14H18N2O/c17-14-13(15-9-4-5-10-15)8-11-16(14)12-6-2-1-3-7-12/h1-3,6-7,13H,4-5,8-11H2
charge 0 multiplicity 1
35 atoms
O  -0.144648 1.398888 -1.521612
N  -2.467846 -0.119311 0.113605
N  0.685855 -0.530759 -0.392088
C  -1.619577 -0.559469 -1.023281
C  -1.123346 -2.010889 -0.837711
C  -3.799211 -0.795995 0.158862
C  -2.792802 1.339973 0.136688
C  -4.645045 0.070184 1.134939
C  -3.878712 1.430634 1.230843
C  0.15171 -1.856579 0.021633
C  -0.294583 0.243524 -1.032574
C  2.012706 -0.125332 -0.057423
C  2.582952 1.069165 -0.584264
C  2.78975 -0.93261 0.820518
C  3.900881 1.429067 -0.236259
C  4.107396 -0.557806 1.156671
C  4.675417 0.623795 0.630577
H  -2.136415 -0.406036 -2.001844
H  -0.863742 -2.441839 -1.82158
H  -1.865811 -2.665986 -0.356854
H  -3.704657 -1.842325 0.497217
H  -4.273299 -0.807251 -0.856208
H  -3.192879 1.68118 -0.850185
H  -1.896802 1.940747 0.356211
H  -4.721489 -0.405835 2.127298
H  -5.671366 0.19965 0.749105
H  -4.537558 2.303029 1.079164
H  -3.403245 1.531595 2.221543
H  -0.084011 -1.852438 1.102664
H  0.893507 -2.647833 -0.183205
H  1.987158 1.69829 -1.247525
H  2.370645 -1.84377 1.257475
H  4.324601 2.350644 -0.651261
H  4.687743 -1.192322 1.836045
H  5.698919 0.912322 0.892615
