program: Gaussian 09
title: 000110638
version: EM64L-G09RevD.01
frameworkgroup: C1[X(C14H14O2S)]
method: RPBEPBE
basis: SDD
operation: Freq
keyword: #p
keyword: freq=noraman
keyword: PBEPBE/SDD
title: #p freq=noraman PBEPBE/SDD
converged: YES YES NO NO
title: Mulliken charges:
elementType: S O O C C C C C C C C C C C C C C H H H H H H H H H H H H H H
charge: 0.188318 -0.434390 -0.218461 0.430184 0.184443 -0.884152 0.405074 -0.427602 -0.458529 -0.367468 -0.448733 -0.243331 -0.430861 -0.259152 -0.242350 -0.669193 0.261286 0.307392 0.277943 0.235905 0.289667 0.255509 0.239668 0.229059 0.237252 0.225752 0.228843 0.248577 0.235482 0.225089 0.378780
chargesum: 0.00000
title: Mulliken charges with hydrogens summed into heavy atoms:
elementType: S O O C C C C C C C C C C C C C C
charge: 0.188318 -0.055610 -0.218461 0.430184 0.184443 -0.298818 0.405074 -0.191697 -0.168863 -0.111959 -0.209066 -0.014272 -0.193609 -0.033400 -0.013507 0.039956 0.261286
polarizability: 2.36087732e+02 4.44806558e+00 2.06744721e+02 4.52628473e+00 -8.63047522e+00 1.01729780e+02
1716.lowfreq: -10.5728 -0.0015 -0.0009 -0.0006 5.1415 8.5895 23.1787 26.6023 47.2290
frequency: 22.8895 26.5868 47.0471 67.5171 81.0459 120.2049 149.5602 178.7663 200.7690 209.8652 245.5234 259.3997 287.8299 305.8365 414.8490 428.8450 447.8340 472.0762 487.8574 507.5187 533.0239 549.5582 580.2247 583.2074 622.4584 632.6810 688.2469 700.7070 718.3569 746.7410 785.3905 792.3856 796.3039 815.1280 862.3819 882.9029 906.7556 924.8822 961.0985 984.9334 992.3969 993.3261 1016.8261 1022.5936 1041.0988 1073.9348 1079.0732 1117.0184 1131.4466 1152.5926 1175.4671 1183.0966 1193.1937 1236.9718 1244.0188 1246.3004 1255.1778 1280.8958 1336.1853 1379.9334 1399.4885 1407.4081 1420.7948 1442.0550 1456.5840 1463.5404 1471.7217 1477.4027 1518.6554 1589.4403 1598.2218 1634.2219 1664.3230 2998.2899 3027.5751 3053.8389 3093.4369 3101.0215 3114.9723 3120.9942 3121.9963 3129.6447 3132.7396 3150.5647 3157.2579 3164.3920 3513.7320
redmass: 6.9810 4.9738 6.1612 6.2397 5.9695 4.9491 4.8594 4.0700 6.6058 1.1003 3.9077 3.5000 2.9378 3.9979 3.3311 3.1316 4.5988 3.2825 5.6017 5.6508 4.3359 2.8521 4.4076 4.9067 3.0962 1.6414 3.3885 4.8603 4.5200 1.4306 4.6609 1.8296 3.1228 1.6159 3.2829 1.9842 1.6589 1.4495 1.3835 1.3642 1.6474 1.3824 2.7956 2.8034 2.2274 1.4906 2.2848 2.4038 1.1519 1.3940 1.1189 1.2091 1.2350 1.7510 1.4798 1.2993 1.6869 1.8515 1.9709 2.1933 1.2023 3.0322 5.4029 2.4269 2.5303 1.0406 1.0494 1.1338 3.7208 7.5378 5.2775 6.5628 8.3942 1.0364 1.0572 1.0864 1.0983 1.1084 1.1009 1.0863 1.0859 1.0918 1.0888 1.0944 1.0992 1.1000 1.0640
irintensity: 0.2875 0.3709 0.3465 0.4807 0.7563 0.4418 0.9989 2.1001 2.6345 0.3240 0.9214 1.2892 1.5144 2.5805 8.3225 1.0394 15.8888 0.1052 4.3652 2.1578 12.5963 24.6631 2.7079 12.5297 41.4900 121.8962 2.4798 3.6969 26.1175 2.3476 6.5244 90.5945 1.4716 35.5254 0.8056 7.0695 1.6650 0.2568 0.2911 0.6307 32.9067 2.4977 98.5691 76.8077 3.3269 27.6289 2.4675 29.1058 0.2240 1.8223 2.8648 0.5355 13.6357 4.8182 3.1643 2.4761 12.2335 0.0891 25.5397 12.2438 22.7190 2.6319 0.1782 5.1338 0.0216 12.9088 9.5239 10.5454 10.4087 0.1463 3.3676 0.0835 286.1825 22.8407 15.8169 5.1094 19.7681 4.5108 12.3647 1.8644 0.4595 18.4410 11.6529 27.6225 38.6782 21.3127 22.6126
temp: 298.150 k
press: 1.00000 atm
elementType: 16 8 8 6 6 6 6 6 6 6 6 6 6 6 6 6 6 1 1 1 1 1 1 1 1 1 1 1 1 1 1
symmnumber: 1
zpe: 637639.8 jmol-1
zpe.correction: 0.242864 hartree
zpe.thermalcorrener: 0.258857 hartree
zpe.thermalcorrenthalpy: 0.259801 hartree
zpe.thermalcorrgfe: 0.197348 hartree
zpe.sumelectzpe: -1089.195994 hartree
zpe.sumelectthermal: -1089.180001 hartree
zpe.sumelectthermalent: -1089.179057 hartree
zpe.sumelectthermalfe: -1089.241510 hartree
dipole: -0.8288 -0.8496 2.1834
dipole: 2.4851
quadrupole: -100.0592 -96.1631 -112.0249
quadrupole: -5.6319 8.7687 1.5127
quadrupole: 2.6899 6.5860 -9.2758 -5.6319 8.7687 1.5127
hfenergy: -1089.4388581 hartree
pointgroup: C01 [X(C14H14O2S1)]
dipole: 0.2506634 0.4310495 0.8410229 debye
polarizability: 235.631959|5.668295|207.969268|3.5386609|-1.2640618|100.9610064 unknown
InChI: InChI=1S/C14H14O2S/c1-10(14(15)16)17-9-12-7-4-6-11-5-2-3-8-13(11)12/h2-8,10,15H,9H2,1H3
charge 0 multiplicity 1
31 atoms
S  -1.829507 0.774461 -1.022139
O  -2.991159 -1.275492 1.305014
O  -4.173727 -1.954938 -0.578222
C  0.61108 1.199469 0.342791
C  1.406709 -0.001892 0.20286
C  -0.872408 1.135727 0.609407
C  2.834202 0.122463 -0.024578
C  1.234491 2.45159 0.237429
C  -3.577246 0.436999 -0.294184
C  0.840342 -1.318591 0.278115
C  3.425234 1.425646 -0.118878
C  2.638649 2.570798 0.006371
C  3.631326 -1.063364 -0.153249
C  1.642345 -2.455152 0.147342
C  3.05101 -2.32969 -0.067542
C  -4.636959 0.826412 -1.330708
C  -3.642647 -1.032927 0.075675
H  -1.153685 0.332801 1.309172
H  -1.247236 2.100789 0.986604
H  0.628768 3.360308 0.336133
H  -3.646249 1.049507 0.620439
H  -0.239504 -1.430882 0.417199
H  4.504877 1.507267 -0.292759
H  3.091085 3.565389 -0.068579
H  4.709589 -0.956819 -0.322941
H  1.191912 -3.452591 0.200461
H  3.667568 -3.229473 -0.169272
H  -4.529158 0.225302 -2.249098
H  -4.541052 1.893884 -1.588797
H  -5.651241 0.644893 -0.931086
H  -3.030212 -2.250492 1.503517
