program: Gaussian 09
title: 000110636
version: EM64L-G09RevD.01
frameworkgroup: C1[X(C12H22O2)]
method: RPBEPBE
basis: SDD
operation: Freq
keyword: #pfreq=noraman
keyword: PBEPBE/SDD
title: #p freq=noraman PBEPBE/SDD
converged: YES YES NO NO
title: Mulliken charges:
elementType: O O C C C C C C C C C C C C H H H H H H H H H H H H H H H H H H H H H H
charge: -0.281233 -0.253961 0.020321 -0.049881 -0.518927 -0.011660 -0.475286 -0.449231 -0.044055 -0.750620 -0.735242 -0.739547 0.285195 -0.763972 0.199028 0.210237 0.241334 0.206252 0.235425 0.212195 0.190059 0.200806 0.195827 0.197135 0.236443 0.212168 0.206247 0.210096 0.208824 0.227652 0.208015 0.210822 0.224772 0.244787 0.245951 0.244025
chargesum: 0.00000
title: Mulliken charges with hydrogens summed into heavy atoms:
elementType: O O C C C C C C C C C C C C
charge: -0.281233 -0.253961 0.219349 0.160356 -0.071340 0.223765 -0.073033 -0.052598 0.153080 -0.095763 -0.088670 -0.095938 0.285195 -0.029209
polarizability: 1.55722761e+02 -2.69872821e+00 1.36536212e+02 -2.66997750e+00 -2.32407907e+00 1.09506615e+02
1716.lowfreq: -9.7722 -2.8829 -0.0005 -0.0004 0.0005 10.7908 16.1129 34.9934 41.7108
frequency: 8.8051 34.8496 41.5385 70.7175 74.9974 95.8135 158.1119 182.8847 203.7881 212.1407 215.9724 228.4271 235.5273 291.3408 307.8790 348.0839 367.8178 376.8292 420.6190 423.7109 463.8566 480.3873 523.9416 550.4562 575.0333 618.9531 777.1979 809.4054 824.6287 863.8148 872.0500 906.6776 916.2080 919.5627 942.2365 954.1552 954.8705 987.3748 996.7350 1028.9210 1040.3023 1044.0795 1071.3498 1100.3846 1107.8736 1119.7762 1154.7214 1164.8351 1170.3230 1181.1449 1208.5896 1230.3546 1238.9013 1268.7676 1276.3721 1297.2294 1304.1317 1311.0831 1320.4540 1327.9911 1332.4393 1339.2211 1350.2469 1369.4509 1379.3326 1381.3557 1387.2081 1396.5660 1453.0521 1455.4294 1457.9992 1463.9517 1467.7611 1468.3982 1474.7917 1478.4229 1482.1888 1482.6655 1495.9894 1642.1069 2928.0106 2948.7006 2958.6140 2962.5680 2969.5213 2970.0961 2973.8650 2974.2834 2978.7259 3005.0784 3006.0990 3028.3169 3042.1736 3058.7593 3064.0465 3065.9905 3066.9781 3077.8730 3082.0734 3087.1544 3094.1800 3140.9297
redmass: 1.0897 2.5272 7.0941 2.8545 2.7290 3.1621 2.3383 2.6329 1.3563 1.4047 1.3031 1.5483 2.6392 3.0296 2.8513 2.4496 2.1239 2.7429 2.4578 2.6732 3.1040 2.7221 2.6168 2.3856 3.1722 4.7553 2.0506 2.6482 2.2278 2.2602 2.5137 2.0661 1.1817 2.0004 1.6046 1.4212 2.3013 1.5892 1.9532 1.8284 1.6634 2.4913 1.2549 2.5214 2.4065 2.1161 2.3784 2.0885 1.7782 2.0175 3.4513 1.5209 1.2697 1.2477 1.3245 1.2916 1.2925 1.2901 1.3657 1.3427 1.4066 1.4699 1.6295 1.5519 1.2098 1.2460 1.2593 1.2052 1.0651 1.0477 1.0796 1.0776 1.0627 1.0808 1.0586 1.0458 1.0567 1.0590 1.0475 9.1014 1.0802 1.0830 1.0681 1.0656 1.0725 1.0376 1.0407 1.0372 1.0658 1.0817 1.0381 1.0976 1.0976 1.0991 1.0985 1.0983 1.0981 1.0981 1.0976 1.0986 1.0974 1.1009
irintensity: 1.1579 0.0652 1.5415 0.5151 1.3624 1.0630 0.7232 3.9324 0.8188 1.2402 0.1366 0.1867 1.7179 2.3427 1.8911 0.3411 0.6607 3.7306 0.4931 0.6377 1.9437 1.5744 0.6180 0.5940 4.8776 5.5641 0.6959 4.8973 2.7127 5.2834 10.3694 7.9459 1.0080 22.9704 12.3224 5.7463 71.5207 6.4063 108.1237 3.7608 7.2928 11.4753 0.8353 4.8972 6.9239 0.6461 1.9168 1.7068 15.8638 1.1395 355.6230 2.2369 2.2470 7.9656 2.6362 0.1508 1.7926 6.8154 0.1410 1.0417 2.9286 0.4810 4.9250 6.6130 27.8112 43.0044 13.9769 19.0758 26.4481 18.8138 6.6372 9.9598 0.6526 5.0656 12.0443 4.0642 17.4864 5.1079 24.2609 170.5922 1.2893 18.8066 17.0000 34.6940 12.9131 27.3068 62.9570 25.3172 21.2850 31.9425 7.2281 44.5247 50.7900 2.7186 27.3974 46.8255 104.2062 44.7540 39.5614 31.2081 8.9369 11.8091
temp: 298.150 k
press: 1.00000 atm
elementType: 8 8 6 6 6 6 6 6 6 6 6 6 6 6 1 1 1 1 1 1 1 1 1 1 1 1 1 1 1 1 1 1 1 1 1 1
symmnumber: 1
zpe: 834081.9 jmol-1
zpe.correction: 0.317685 hartree
zpe.thermalcorrener: 0.334269 hartree
zpe.thermalcorrenthalpy: 0.335213 hartree
zpe.thermalcorrgfe: 0.271513 hartree
zpe.sumelectzpe: -619.804479 hartree
zpe.sumelectthermal: -619.787896 hartree
zpe.sumelectthermalent: -619.786952 hartree
zpe.sumelectthermalfe: -619.850651 hartree
dipole: -0.5578 1.2629 -1.6051
dipole: 2.1171
quadrupole: -82.7486 -88.7631 -90.1399
quadrupole: 0.2196 -4.3605 4.8254
quadrupole: 4.4686 -1.5459 -2.9227 0.2196 -4.3605 4.8254
hfenergy: -620.1221643 hartree
pointgroup: C01 [X(C12H22O2)]
dipole: -0.2527065 -0.4817142 0.630787 debye
polarizability: 155.7002419|2.1839517|136.3192765|3.8353531|-2.6806007|109.7460686 unknown
InChI: InChI=1S/C12H22O2/c1-8(2)11-6-5-9(3)12(7-11)14-10(4)13/h8-9,11-12H,5-7H2,1-4H3
charge 0 multiplicity 1
36 atoms
O  2.073734 0.102256 0.586989
O  2.41689 1.623962 -1.152793
C  -1.722587 0.064733 -0.169214
C  0.604433 -1.841586 0.356401
C  -0.352011 0.542655 0.386257
C  0.799702 -0.374238 -0.060415
C  -1.938075 -1.423313 0.2200
C  -0.756651 -2.321278 -0.212977
C  -2.892999 0.983117 0.309386
C  1.767309 -2.741582 -0.108593
C  -2.667229 2.468533 -0.071399
C  -4.261447 0.516432 -0.248991
C  2.780432 1.113326 -0.067397
C  4.022077 1.481192 0.718789
H  -1.68523 0.127584 -1.280921
H  0.548308 -1.870363 1.465275
H  -0.132914 1.569171 0.045543
H  -0.390124 0.553418 1.495097
H  0.937945 -0.296237 -1.157866
H  -2.868084 -1.808578 -0.236681
H  -2.068735 -1.489631 1.321407
H  -0.934985 -3.365565 0.109758
H  -0.695283 -2.340038 -1.321975
H  -2.934495 0.915327 1.419147
H  2.726577 -2.403432 0.31963
H  1.600267 -3.789535 0.202528
H  1.859812 -2.728047 -1.212023
H  -2.530196 2.575917 -1.165162
H  -3.542654 3.078906 0.218707
H  -1.782512 2.903625 0.424889
H  -4.245058 0.494839 -1.356373
H  -5.062718 1.212954 0.060386
H  -4.54166 -0.490102 0.10745
H  4.64867 0.587745 0.883463
H  3.739115 1.870918 1.712254
H  4.595178 2.243617 0.171823
