program: Gaussian 09
title: 000110633
version: EM64L-G09RevD.01
frameworkgroup: C1[X(C14H22N6O5)]
method: RPBEPBE
basis: SDD
operation: Freq
keyword: #p
keyword: freq=noraman
keyword: PBEPBE/SDD
title: #p freq=noraman PBEPBE/SDD
converged: YES YES NO NO
title: Mulliken charges:
elementType: O O O O O N N N N N N C C C C C C C C C C C C C C H H H H H H H H H H H H H H H H H H H H H H
charge: -0.285318 -0.259258 -0.504815 -0.252143 -0.217079 -0.177841 -0.575619 -0.455520 -0.035709 -0.055761 -0.632848 -0.025270 -0.214803 0.025991 -0.374979 -0.729380 -0.703648 0.245558 -0.281651 -0.325751 0.341533 -0.124880 -0.245424 0.010147 0.130441 0.199217 0.245712 0.216049 0.253241 0.238819 0.220551 0.245163 0.217931 0.212339 0.250594 0.200613 0.266720 0.216326 0.209164 0.241548 0.280494 0.288872 0.268933 0.418496 0.379281 0.343940 0.310026
chargesum: 0.00000
title: Mulliken charges with hydrogens summed into heavy atoms:
elementType: O O O O O N N N N N N C C C C C C C C C C C C C C
charge: -0.285318 -0.259258 -0.125535 -0.252143 -0.217079 -0.177841 -0.006253 -0.037025 -0.035709 -0.055761 0.021118 0.173947 0.030909 0.242040 0.117081 -0.045735 -0.040103 0.245558 0.201395 0.124961 0.341533 -0.124880 0.023509 0.010147 0.130441
polarizability: 2.40059555e+02 -8.38084040e+00 2.27792668e+02 2.41795503e+01 1.14088878e+01 1.66595224e+02
1716.lowfreq: -7.8181 -5.6994 -0.0007 -0.0007 -0.0004 1.7838 7.0458 13.1564 30.7317
frequency: 3.6802 12.6215 30.5865 43.5090 55.7842 64.5643 83.2064 86.9103 104.2224 122.6117 132.8457 142.1570 163.1444 177.8082 180.2985 194.5684 200.7545 220.9388 226.1058 240.8313 255.3351 262.3347 277.6996 293.0838 308.7174 318.9017 327.6201 331.0918 344.3768 368.2819 383.7056 390.9977 412.6745 427.5725 468.0353 488.5785 512.7640 555.5916 572.3475 600.2272 613.7711 622.3720 645.4838 652.3837 654.2823 665.4092 696.0464 707.4997 739.3819 745.6793 782.5692 791.1841 798.1305 822.4208 844.8812 853.8758 871.6444 916.6978 921.9618 936.9714 937.1999 960.1631 966.0928 989.8263 1009.5349 1016.5262 1021.5109 1044.7343 1050.6323 1074.1443 1081.3894 1091.5511 1103.7738 1146.6229 1151.5928 1162.5672 1191.0825 1195.7095 1199.1838 1212.1429 1229.9157 1241.2860 1253.7898 1263.5925 1280.7051 1288.0256 1314.1778 1321.5368 1325.0708 1339.2680 1351.1779 1357.9515 1365.9881 1374.0648 1386.2190 1391.8119 1397.4247 1402.8752 1436.5644 1450.9105 1460.0021 1462.7245 1470.5534 1483.4198 1486.4646 1488.6431 1536.1864 1548.9153 1602.9886 1625.0855 1634.7402 1643.7610 1651.0265 2934.4809 2940.6761 2974.9797 2979.4285 2985.0063 2996.0110 3023.6105 3026.2514 3059.5039 3067.5505 3067.8325 3076.1908 3077.6093 3092.8675 3095.3549 3216.6635 3231.7313 3469.7734 3527.3712 3590.0756 3598.5213 3681.2251
redmass: 3.4997 5.4045 4.5877 5.6785 4.6452 3.8470 5.6826 5.5281 5.9458 4.0983 5.8145 4.1841 3.8390 1.4909 2.1603 2.8770 1.4845 3.4009 4.0294 1.1933 3.9822 3.7234 3.2109 3.3451 4.4004 2.6670 4.3600 3.2055 2.0252 2.9056 2.4761 1.2416 3.3707 2.8689 7.3957 5.2198 3.4256 1.2120 3.2085 6.1593 2.4055 3.6085 4.7596 3.7012 5.1412 2.7847 8.4843 5.1469 4.6282 1.7909 4.9613 3.2558 2.9865 3.2934 3.5462 1.9258 3.1590 1.4225 1.6410 5.7963 2.3938 1.5546 4.8257 4.2015 2.3976 3.0095 2.2480 1.6227 3.9043 2.7791 1.6534 3.2370 1.7096 2.2208 1.9522 2.1527 2.0852 1.8622 2.2650 1.3118 1.1123 1.3231 1.1722 2.7775 1.7522 1.5190 1.3922 1.4014 1.4726 3.4780 2.0243 1.3734 1.3649 1.2117 1.4834 1.2314 5.9183 1.5205 3.1211 1.1026 1.0814 1.0477 1.0514 1.0545 1.1456 1.0547 4.3363 2.9395 1.3357 9.9591 9.2705 3.9747 1.0908 1.0822 1.0659 1.0413 1.0391 1.0739 1.0573 1.0592 1.0842 1.0979 1.1066 1.0999 1.0990 1.0998 1.0994 1.1070 1.0853 1.0983 1.0454 1.0451 1.0972 1.0667 1.1037
irintensity: 0.7951 2.8798 2.2557 3.4309 2.1526 0.7471 3.6569 5.9208 1.0114 1.6716 3.3307 0.1213 2.2843 36.3537 6.4376 3.6214 6.6847 2.3501 4.8600 7.2101 3.3448 26.2376 7.1453 4.5105 3.7868 35.6904 4.1820 4.2536 100.2258 14.8356 2.0636 163.7302 14.7760 0.1728 3.8654 0.7562 4.7595 226.5323 6.9841 5.0523 60.6059 4.5230 3.1187 90.0289 26.4709 96.0908 17.8385 26.8492 47.2322 39.9539 3.6314 4.0971 39.5691 16.8676 7.9483 73.9379 16.4045 7.5853 4.1800 9.0728 35.2043 11.4090 53.7631 144.4611 45.6837 102.4444 15.4672 32.6122 26.4837 66.5667 22.1918 179.9543 43.4547 42.2115 4.3608 21.1073 13.1803 19.8022 4.1490 26.0371 10.0093 21.9246 12.1204 3.5794 4.8947 2.8368 5.1634 63.7877 0.7682 52.5232 75.4911 23.0498 8.1180 16.7720 40.3462 28.7642 65.4597 10.7581 23.4699 30.3465 1.1681 5.7182 1.4565 7.6744 26.1338 13.6352 326.9350 67.8314 84.8476 449.3435 151.3552 340.0883 46.6988 26.1362 57.4607 43.0862 19.1217 20.2373 59.1688 38.3915 10.1526 6.3637 17.9638 45.5710 21.0995 37.4020 27.3400 11.5566 743.0972 0.0757 2.8340 61.7549 5.8111 24.1351 42.9613
temp: 298.150 k
press: 1.00000 atm
elementType: 8 8 8 8 8 7 7 7 7 7 7 6 6 6 6 6 6 6 6 6 6 6 6 6 6 1 1 1 1 1 1 1 1 1 1 1 1 1 1 1 1 1 1 1 1 1 1
symmnumber: 1
zpe: 980072.3 jmol-1
zpe.correction: 0.373290 hartree
zpe.thermalcorrener: 0.399366 hartree
zpe.thermalcorrenthalpy: 0.400310 hartree
zpe.thermalcorrgfe: 0.314065 hartree
zpe.sumelectzpe: -1249.385377 hartree
zpe.sumelectthermal: -1249.359301 hartree
zpe.sumelectthermalent: -1249.358357 hartree
zpe.sumelectthermalfe: -1249.444602 hartree
dipole: -11.1665 11.4533 -2.5092
dipole: 16.1915
quadrupole: -199.1273 -143.1970 -140.0832
quadrupole: 33.5520 -3.0025 6.8725
quadrupole: -38.3248 17.6055 20.7193 33.5520 -3.0025 6.8725
hfenergy: -1249.7586671 hartree
pointgroup: C01 [X(C14H22N6O5)]
dipole: -4.409002 -4.4971618 -0.95712 debye
polarizability: 241.9414036|15.2123698|210.9298293|-16.4586762|30.3364159|181.5762136 unknown
InChI: InChI=1S/C14H22N6O5/c1-7(2)9(15)13(23)24-4-8(3-21)25-6-20-5-17-10-11(20)18-14(16)19-12(10)22/h5,7-9,18,21H,3-4,6,15-16H2,1-2H3
charge 0 multiplicity 1
47 atoms
O  -0.467113 -0.803166 0.522939
O  -3.287721 -1.495314 0.14691
O  0.697306 -2.441308 -1.481864
O  -3.13072 -0.033228 1.96536
O  5.279305 2.27449 0.495557
N  1.14983 0.418761 1.713614
N  -5.127602 1.664827 0.760322
N  2.50174 -0.80799 0.009071
N  2.583849 2.163788 2.088192
N  4.660367 0.209644 -0.453147
N  4.000613 -1.778535 -1.528171
C  -3.647202 1.213985 -1.230419
C  -4.476644 0.619669 -0.031078
C  -0.90851 -2.186189 0.300472
C  -2.340222 -2.418253 0.815793
C  -2.547572 2.188065 -0.749969
C  -4.607303 1.894663 -2.229794
C  -3.571018 -0.290327 0.822452
C  0.033236 -0.494148 1.871916
C  -0.754672 -2.418098 -1.20366
C  2.264036 0.217814 0.905099
C  3.14857 1.283366 1.137016
C  1.399752 1.634586 2.407184
C  4.430436 1.347898 0.404825
C  3.758692 -0.742667 -0.62928
H  -3.160948 0.351673 -1.731376
H  -5.256213 -0.026245 -0.477135
H  -0.23567 -2.895455 0.836765
H  -2.389376 -2.256958 1.907484
H  -2.691888 -3.433609 0.566313
H  -1.974853 2.569889 -1.614078
H  -1.829873 1.700103 -0.065612
H  -2.990156 3.063373 -0.239671
H  -4.04113 2.347793 -3.064132
H  -5.180902 2.687204 -1.718855
H  -5.327276 1.171733 -2.658456
H  -0.757883 -0.010728 2.471582
H  0.362378 -1.436929 2.361015
H  -1.206517 -3.387346 -1.488949
H  -1.252226 -1.597702 -1.752946
H  -5.953058 1.351516 1.278268
H  -4.481623 2.185701 1.361886
H  0.680478 2.048342 3.110637
H  1.741267 -1.394872 -0.390649
H  0.870729 -2.224447 -2.430574
H  4.905611 -1.746646 -1.994061
H  3.521695 -2.672826 -1.432598
